program: Gaussian 09
title: 000048386
version: EM64L-G09RevD.01
frameworkgroup: C1[X(C10H19NOS)]
method: RPBEPBE
basis: SDD
operation: Freq
keyword: #p
keyword: freq=noraman
keyword: PBEPBE/SDD
title: #p freq=noraman PBEPBE/SDD
converged: YES YES NO NO
title: Mulliken charges:
elementType: S O N C C C C C C C C C C H H H H H H H H H H H H H H H H H H H
charge: 0.120375 -0.277351 -0.366175 -0.205093 -0.371667 -0.398880 0.261192 -0.705094 -0.707548 -0.706312 -0.615486 -0.004614 -0.550541 0.234664 0.217738 0.262160 0.211001 0.251643 0.212407 0.223380 0.219083 0.216400 0.229987 0.268581 0.267765 0.315926 0.227818 0.221556 0.273384 0.231560 0.222963 0.219178
chargesum: 0.00000
title: Mulliken charges with hydrogens summed into heavy atoms:
elementType: S O N C C C C C C C C C C
charge: 0.120375 -0.277351 -0.050249 -0.205093 0.080735 0.074282 0.261192 -0.017665 -0.042078 -0.169966 0.107272 0.226946 -0.108400
polarizability: 1.74355523e+02 1.14518922e+01 1.36660036e+02 -4.13528899e+00 -1.77770512e+00 1.07331471e+02
1716.lowfreq: -14.8558 -7.4026 -0.0019 -0.0019 -0.0013 5.8392 18.6715 42.1923 59.3927
frequency: 18.5259 41.7956 59.2839 81.9813 91.1045 99.8389 108.9770 127.7745 142.0386 170.5110 198.3152 213.5034 218.5750 245.4459 267.5606 289.9519 321.0382 328.0109 351.7516 397.3387 402.1034 409.6019 555.7207 564.7260 676.7243 703.7402 717.0054 730.7362 763.0514 792.9977 835.1106 884.5868 889.3632 927.1795 938.8908 950.8465 1004.6662 1018.0219 1043.5860 1054.1954 1073.7908 1078.8175 1107.1341 1120.5564 1141.3710 1152.5934 1172.2556 1192.9852 1218.8035 1231.5959 1255.0089 1279.4664 1290.9208 1320.5762 1335.8813 1386.6010 1394.3997 1415.3213 1420.7240 1454.9121 1458.2375 1463.1790 1468.7024 1477.6554 1480.0642 1486.3331 1487.4724 1495.6051 1514.2843 1597.6752 1653.8474 2975.8975 2980.7031 2988.3927 2991.1625 2999.2665 3015.2639 3041.3156 3044.3433 3054.6497 3075.9964 3079.3522 3081.4982 3087.2938 3092.0222 3094.2816 3103.4306 3112.8883 3202.0548 3443.9993
redmass: 3.1626 4.0169 3.3241 2.6423 1.1274 2.4195 2.3463 3.2264 1.8931 2.7010 2.8611 1.0667 3.0910 2.9009 3.1211 2.3046 2.5371 3.3131 3.5699 4.1497 2.4022 5.3621 2.8713 2.1412 3.2401 1.3388 2.3222 2.2377 1.7590 1.4281 2.1205 1.3424 2.4663 1.7812 1.9253 1.3368 1.1178 1.8116 2.0507 3.0839 2.3969 1.3604 1.9323 1.3052 1.8080 2.0436 3.0168 1.5847 2.0506 1.2024 1.1826 1.2102 1.2213 1.3618 1.4986 1.2158 1.1964 1.1896 1.1563 1.2084 1.1706 1.0678 1.0512 1.0628 1.0594 1.0471 1.0428 1.0661 1.4562 7.6057 4.6017 1.0345 1.0359 1.0383 1.0570 1.0634 1.0558 1.1010 1.0970 1.1021 1.0990 1.0998 1.0995 1.0892 1.0750 1.1004 1.0986 1.0969 1.1147 1.0778
irintensity: 0.1852 5.2056 1.3205 0.1505 0.1215 0.5581 0.7393 0.6591 0.3049 4.8239 3.9862 0.0660 2.2630 1.2562 1.9920 3.2524 3.2439 12.9869 1.3066 1.1352 2.2956 6.5443 4.5303 4.2473 5.8904 105.9804 10.0411 6.3008 5.1928 11.2592 22.1591 8.3711 7.2279 12.0249 3.2441 75.8803 16.5476 3.4762 4.4890 2.1153 3.7405 6.0481 26.5876 1.1829 48.9157 2.2135 11.8662 1.8087 22.9930 5.3781 3.9300 0.2545 0.6523 5.0982 0.1462 24.9131 18.3324 24.0027 7.7923 70.6075 23.3997 6.6700 21.0760 17.1259 15.5998 13.8030 2.5152 2.2948 107.9967 163.0827 9.7777 79.9907 29.9356 33.3172 20.3080 9.4432 17.9041 12.3297 5.2274 33.3162 53.0031 36.7622 27.5504 0.5113 12.1917 31.8958 3.0438 14.5618 27.0660 64.0731
temp: 298.150 k
press: 1.00000 atm
elementType: 16 8 7 6 6 6 6 6 6 6 6 6 6 1 1 1 1 1 1 1 1 1 1 1 1 1 1 1 1 1 1 1
symmnumber: 1
zpe: 716125.1 jmol-1
zpe.correction: 0.272758 hartree
zpe.thermalcorrener: 0.289953 hartree
zpe.thermalcorrenthalpy: 0.290897 hartree
zpe.thermalcorrgfe: 0.226759 hartree
zpe.sumelectzpe: -919.435107 hartree
zpe.sumelectthermal: -919.417912 hartree
zpe.sumelectthermalent: -919.416968 hartree
zpe.sumelectthermalfe: -919.481105 hartree
dipole: 1.7721 0.3419 -1.4380
dipole: 2.3076
quadrupole: -86.6531 -82.0794 -93.9230
quadrupole: 4.6730 5.8917 -5.3461
quadrupole: 0.8987 5.4724 -6.3712 4.6730 5.8917 -5.3461
hfenergy: -919.7078645 hartree
pointgroup: C01 [X(C10H19N1O1S1)]
dipole: -0.6507248 -0.2029728 -0.5996877 debye
polarizability: 171.9324492|13.9866765|138.5195378|7.4638765|1.7647949|107.8950431 unknown
InChI: InChI=1S/C10H19NOS/c1-5-8-13-10(6-2,7-3)9(12)11-4/h5,11H,1,6-8H2,2-4H3
charge 0 multiplicity 1
32 atoms
S  -0.830338 0.659755 -1.094599
O  1.688539 -1.165103 1.512732
N  0.421982 -1.967789 -0.269293
C  0.840832 0.487691 -0.112025
C  1.922178 0.708441 -1.221318
C  0.923007 1.520713 1.039042
C  1.000627 -0.952066 0.463474
C  3.376799 0.665602 -0.701019
C  0.887415 2.996847 0.599621
C  -2.12059 0.352118 0.288703
C  0.579611 -3.381933 0.082427
C  -3.500763 0.517337 -0.286136
C  -4.417754 -0.479669 -0.373083
H  1.729326 1.684442 -1.705636
H  1.787076 -0.064707 -2.002604
H  1.850398 1.303601 1.600143
H  0.106706 1.321477 1.759637
H  3.592013 -0.279094 -0.172777
H  4.079721 0.758826 -1.548694
H  3.581948 1.494526 -0.00048
H  1.781819 3.273291 0.012181
H  0.858376 3.656551 1.485882
H  -0.003611 3.208477 -0.019292
H  -1.958076 -0.659961 0.694965
H  -1.925384 1.103704 1.072708
H  -0.162442 -1.684433 -1.065568
H  1.105801 -3.937753 -0.71609
H  -0.399984 -3.862346 0.262401
H  1.178623 -3.432022 1.00639
H  -3.757177 1.524103 -0.64592
H  -5.41705 -0.302597 -0.785492
H  -4.196729 -1.497524 -0.028678
