program: Orca
programVersion: 5.0.2
elementType: N H C C H H O C C O N H H H C C O H H O H N H H H
charge: 1
multiplicity: 1
keywords: wB97X-D3BJ Opt Freq def2-TZVPP def2/J RIJCOSX VeryTightSCF
keywords: PAL8 defgrid3 VeryTightOpt
frequency: 0.00 0.00 0.00 0.00 0.00 0.00 19.46 41.51 60.21 80.24 83.78 98.58 139.30 191.53 257.58 288.15 299.72 347.16 356.00 413.34 471.69 482.94 498.80 531.02 580.55 585.58 654.25 665.27 712.03 754.26 806.38 874.78 886.32 920.32 931.18 1004.37 1026.60 1060.12 1081.29 1113.09 1119.22 1154.24 1209.38 1235.42 1291.68 1304.61 1314.59 1324.50 1333.38 1373.53 1397.42 1425.84 1442.37 1466.10 1501.25 1506.51 1554.12 1634.74 1649.12 1669.58 1792.65 1817.27 1842.87 2903.08 3101.59 3119.11 3127.75 3153.66 3191.17 3204.62 3516.52 3557.67 3578.64 3674.69 3840.43
frequency: 19.46 41.51 60.21 80.24 83.78 98.58 139.30 191.53 257.58 288.15 299.72 347.16 356.00 413.34 471.69 482.94 498.80 531.02 580.55 585.58 654.25 665.27 712.03 754.26 806.38 874.78 886.32 920.32 931.18 1004.37 1026.60 1060.12 1081.29 1113.09 1119.22 1154.24 1209.38 1235.42 1291.68 1304.61 1314.59 1324.50 1333.38 1373.53 1397.42 1425.84 1442.37 1466.10 1501.25 1506.51 1554.12 1634.74 1649.12 1669.58 1792.65 1817.27 1842.87 2903.08 3101.59 3119.11 3127.75 3153.66 3191.17 3204.62 3516.52 3557.67 3578.64 3674.69 3840.43
formula: C6H12N3O4
InChI: InChI=1S/C6H12N3O4/c7-1-4(10)8-2-5(11)9-3-6(12)13/h8-9,12H,1-3H2,7H3
25 atoms
N  -2.453348 0.081479 -1.80621
H  -2.966336 -0.026213 -0.948043
C  -2.609806 -0.940112 -2.807928
C  -1.609142 -2.078703 -2.576004
H  -3.622971 -1.344721 -2.773924
H  -2.443785 -0.516561 -3.799881
O  -0.947311 -2.188488 -1.573557
C  -1.251609 0.733367 -1.767434
C  -0.806135 1.201951 -0.383497
O  -0.506733 0.781355 -2.721074
N  -0.022553 0.068335 0.119896
H  -1.632187 1.413817 0.295322
H  -0.159608 2.070628 -0.468429
H  -0.480703 -0.83128 0.026706
C  1.304934 0.045227 -0.000587
C  1.95736 -1.348258 0.068533
O  2.048136 1.005974 -0.152557
H  1.546686 -2.009985 -0.693143
H  1.833101 -1.801491 1.050096
O  -1.50443 -2.979418 -3.551214
H  -2.059155 -2.757787 -4.307529
N  3.403554 -1.07526 -0.188077
H  3.407161 -0.015194 -0.236854
H  4.018384 -1.401108 0.553619
H  3.72726 -1.457436 -1.073974
totalener: -701.29002218 hartree
nucrepener: 862.64161152 hartree
electener: -1563.93163370 hartree
oneelecener: -2654.26485273 hartree
twoeener: 1090.33321903 hartree
kineticenergy: 697.95152722 hartree
exchangeener: -60.041671095748 hartree
correlationener: -4.265719798415 hartree
xcener: -64.307390894163 hartree
temp: 298.15 k
press: 1.00 atm
thermalcorrenthalpy: 0.00094421 hartree
totalenthalpy: -701.11321520 hartree
totalentropycorr: -0.05085718 hartree
gibbsenthalpy: -701.16407238 hartree
gibbsminuselec: 0.16919655 hartree
totalenthalpy: -701.11392704 hartree
chargesum: 1.0000000
charge: -0.204400 0.179561 -0.136682 0.366456 0.154529 0.139348 -0.388094 0.204618 -0.066274 -0.329959 -0.166565 0.136223 0.142602 0.187435 0.275132 -0.169388 -0.347004 0.174613 0.172622 -0.209705 0.229063 -0.049934 0.232205 0.235213 0.238387
charge: 0.319351 -0.024023 -0.056025 -0.421059 0.037637 0.039031 0.097568 -0.389207 -0.007260 0.112939 0.343142 0.024546 0.041404 -0.019923 -0.373075 0.044598 0.137536 0.037166 0.037224 0.404052 -0.085269 0.602448 0.001889 0.045862 0.049448
qa: -0.2044 0.1796 -0.1367 0.3665 0.1545 0.1393 -0.3881 0.2046 -0.0663 -0.3300 -0.1666 0.1362 0.1426 0.1874 0.2751 -0.1694 -0.3470 0.1746 0.1726 -0.2097 0.2291 -0.0499 0.2322 0.2352 0.2384
va: 3.1651 1.0128 3.8753 4.2065 0.9928 1.0079 2.0963 4.2691 3.8085 2.1820 3.2572 0.9995 1.0308 1.0404 4.2422 3.8059 2.1804 1.0095 0.9962 2.2736 1.0152 3.5940 1.0482 0.9729 0.9720
dispcorr: -0.043746302 hartree
energy: -701.337257395114
dipole: 3.26846 -1.36986 1.89860 -1.97063 0.41802 -1.55261 3.53963 -2.11248 1.42715
magnitude: 2.83761 au
magnitude: 7.21264 debye
zeropoint: 0.20878657 hartree
thermalvibcorrection: 0.01076389 hartree
thermalrotcorrection: 0.00141627 hartree
thermaltrasncorrection: 0.00141627 hartree
thermaltotal: -701.11487439 hartree
thermalcorr: 0.01359643 hartree
nonthermalcorr: 0.20878657 hartree
totalcorr: 0.22238301 hartree
totalenthalpy: -701.11393018 hartree
