program: Orca
programVersion: 5.0.2
elementType: N H C C H H O C C O N H H H C C O H H O H N H H H
charge: 1
multiplicity: 1
keywords: wB97X-D3BJ Opt Freq def2-TZVPP def2/J RIJCOSX VeryTightSCF
keywords: PAL8 defgrid3 VeryTightOpt
frequency: 0.00 0.00 0.00 0.00 0.00 0.00 25.82 47.32 57.72 58.75 78.88 93.68 140.97 166.69 194.59 203.06 282.02 314.79 377.45 402.16 460.96 528.13 536.23 573.98 591.61 620.26 660.89 679.05 685.99 734.54 750.55 863.48 915.18 931.64 977.04 1014.54 1030.23 1030.25 1114.18 1115.13 1147.51 1179.09 1212.17 1251.46 1256.63 1269.67 1314.88 1321.73 1335.06 1366.78 1418.93 1426.59 1469.78 1490.44 1500.99 1508.25 1533.01 1587.13 1650.58 1666.68 1786.44 1795.42 1866.94 2822.04 3070.76 3088.34 3111.34 3131.80 3134.31 3195.77 3479.68 3517.00 3578.68 3590.24 3799.93
frequency: 25.82 47.32 57.72 58.75 78.88 93.68 140.97 166.69 194.59 203.06 282.02 314.79 377.45 402.16 460.96 528.13 536.23 573.98 591.61 620.26 660.89 679.05 685.99 734.54 750.55 863.48 915.18 931.64 977.04 1014.54 1030.23 1030.25 1114.18 1115.13 1147.51 1179.09 1212.17 1251.46 1256.63 1269.67 1314.88 1321.73 1335.06 1366.78 1418.93 1426.59 1469.78 1490.44 1500.99 1508.25 1533.01 1587.13 1650.58 1666.68 1786.44 1795.42 1866.94 2822.04 3070.76 3088.34 3111.34 3131.80 3134.31 3195.77 3479.68 3517.00 3578.68 3590.24 3799.93
formula: C6H12N3O4
InChI: InChI=1S/C6H12N3O4/c7-1-4(10)8-2-5(11)9-3-6(12)13/h8-9,12H,1-3H2,7H3
25 atoms
N  -3.290179 1.521285 -0.089638
H  -4.246914 1.189992 -0.0982
C  -3.115621 2.95541 -0.074721
C  -4.488726 3.601166 -0.077933
H  -2.584766 3.303299 0.816081
H  -2.572753 3.320147 -0.951412
O  -5.518642 2.985976 -0.090322
C  -2.316748 0.6007 -0.094342
C  -0.875624 1.121264 -0.081782
O  -2.516572 -0.604196 -0.107829
N  -0.037581 -0.060402 -0.090187
H  -0.686593 1.725515 0.808345
H  -0.677928 1.744145 -0.957061
H  -0.582455 -0.921772 -0.10226
C  1.278074 -0.026539 -0.082365
C  2.014374 -1.381832 -0.093281
O  1.980704 0.985373 -0.067172
H  1.786492 -1.955771 -0.989185
H  1.776174 -1.975773 0.786762
O  -4.389788 4.932418 -0.065167
H  -5.283286 5.302684 -0.067597
N  3.457171 -0.996314 -0.080598
H  3.964572 -1.301537 -0.907796
H  3.373679 0.067645 -0.069312
H  3.954934 -1.319825 0.745505
totalener: -701.29466819 hartree
nucrepener: 793.73012308 hartree
electener: -1495.02479127 hartree
oneelecener: -2517.12625538 hartree
twoeener: 1022.10146411 hartree
kineticenergy: 697.93648193 hartree
exchangeener: -60.043348256322 hartree
correlationener: -4.261856159767 hartree
xcener: -64.305204416089 hartree
temp: 298.15 k
press: 1.00 atm
thermalcorrenthalpy: 0.00094421 hartree
totalenthalpy: -701.11382472 hartree
totalentropycorr: -0.05238916 hartree
gibbsenthalpy: -701.16621388 hartree
gibbsminuselec: 0.16841539 hartree
totalenthalpy: -701.12017521 hartree
chargesum: 1.0000000
charge: -0.164163 0.208762 -0.089789 0.277509 0.130413 0.130259 -0.297516 0.244469 -0.075866 -0.371250 -0.172814 0.134283 0.134262 0.192767 0.266243 -0.160486 -0.367891 0.171453 0.171463 -0.259528 0.246390 -0.055451 0.236688 0.233104 0.236689
charge: 0.339847 -0.003390 -0.042577 -0.434377 0.032339 0.032327 0.133431 -0.381728 -0.016057 0.085787 0.358097 0.033679 0.033643 -0.019751 -0.382146 0.045310 0.119693 0.037844 0.037841 0.378231 -0.075010 0.599696 0.046545 -0.005821 0.046546
qa: -0.1642 0.2088 -0.0898 0.2775 0.1304 0.1303 -0.2975 0.2445 -0.0759 -0.3712 -0.1728 0.1343 0.1343 0.1928 0.2662 -0.1605 -0.3679 0.1715 0.1715 -0.2595 0.2464 -0.0555 0.2367 0.2331 0.2367
va: 3.1748 1.0241 3.8553 4.3791 0.9945 0.9946 2.1960 4.2919 3.8161 2.1460 3.2633 1.0030 1.0030 1.0535 4.1962 3.8240 2.1590 0.9945 0.9945 2.2337 1.0117 3.5840 0.9729 1.0520 0.9729
dispcorr: -0.040401058 hartree
energy: -701.342704009445
dipole: 13.50606 -7.52824 5.97782 -5.03363 2.78161 -2.25202 0.02132 -0.01308 0.00824
magnitude: 6.38796 au
magnitude: 16.23691 debye
zeropoint: 0.20761811 hartree
thermalvibcorrection: 0.01101037 hartree
thermalrotcorrection: 0.00141627 hartree
thermaltrasncorrection: 0.00141627 hartree
thermaltotal: -701.12124299 hartree
thermalcorr: 0.01384291 hartree
nonthermalcorr: 0.20761811 hartree
totalcorr: 0.22146102 hartree
totalenthalpy: -701.12029878 hartree
