program: Orca
programVersion: 5.0.2
elementType: N H C C H H O C C O N H H H C C O H H O H N H H H
charge: 1
multiplicity: 1
keywords: wB97X-D3BJ Opt Freq def2-TZVPP def2/J RIJCOSX VeryTightSCF
keywords: PAL8 defgrid3 VeryTightOpt
frequency: 0.00 0.00 0.00 0.00 0.00 0.00 32.24 52.99 83.67 97.48 117.25 144.70 185.10 203.20 254.98 261.26 267.04 299.00 377.69 408.19 435.56 484.61 529.94 543.71 588.41 613.06 628.46 644.79 711.08 722.75 764.14 858.50 889.92 914.29 921.94 995.43 1013.08 1058.48 1082.78 1131.15 1137.39 1164.55 1223.77 1257.77 1283.93 1295.70 1347.12 1364.75 1386.05 1412.92 1431.17 1440.97 1488.48 1494.27 1505.09 1507.50 1525.13 1595.27 1607.95 1685.59 1782.91 1794.46 1818.95 3090.16 3124.48 3128.10 3187.03 3192.39 3194.06 3286.82 3375.72 3559.79 3641.34 3656.21 3793.26
frequency: 32.24 52.99 83.67 97.48 117.25 144.70 185.10 203.20 254.98 261.26 267.04 299.00 377.69 408.19 435.56 484.61 529.94 543.71 588.41 613.06 628.46 644.79 711.08 722.75 764.14 858.50 889.92 914.29 921.94 995.43 1013.08 1058.48 1082.78 1131.15 1137.39 1164.55 1223.77 1257.77 1283.93 1295.70 1347.12 1364.75 1386.05 1412.92 1431.17 1440.97 1488.48 1494.27 1505.09 1507.50 1525.13 1595.27 1607.95 1685.59 1782.91 1794.46 1818.95 3090.16 3124.48 3128.10 3187.03 3192.39 3194.06 3286.82 3375.72 3559.79 3641.34 3656.21 3793.26
formula: C6H12N3O4
InChI: InChI=1S/C6H12N3O4/c7-1-4(10)8-2-5(11)9-3-6(12)13/h8-9,12H,1-3H2,7H3
25 atoms
N  -1.058979 1.536112 -2.456671
H  -1.718265 1.617182 -3.215768
C  0.347014 1.532495 -2.779858
C  0.79336 0.206484 -3.380802
H  0.555146 2.306622 -3.523753
H  0.958472 1.74773 -1.908168
O  1.718381 -0.476428 -2.980434
C  -1.650296 1.39707 -1.22946
C  -0.751305 1.253799 0.003148
O  -2.852867 1.388562 -1.1065
N  0.02784 0.020259 -0.032196
H  -1.415646 1.253319 0.864762
H  -0.052902 2.084404 0.09446
H  -0.472863 -0.853674 -0.048657
C  1.363898 0.011202 -0.024537
C  2.051054 -1.354659 -0.108721
O  2.078796 1.001679 0.006304
H  1.481173 -2.097365 -0.662241
H  2.284586 -1.723352 0.889956
O  0.054057 -0.138604 -4.422457
H  0.370298 -0.977645 -4.786113
N  3.320597 -1.073777 -0.836722
H  3.071523 -0.890004 -1.822839
H  3.680538 -0.186838 -0.457504
H  4.010571 -1.817161 -0.760169
totalener: -701.29643073 hartree
nucrepener: 881.79237561 hartree
electener: -1583.08880633 hartree
oneelecener: -2691.50526955 hartree
twoeener: 1108.41646322 hartree
kineticenergy: 697.96127916 hartree
exchangeener: -60.048201703101 hartree
correlationener: -4.267256976528 hartree
xcener: -64.315458679629 hartree
temp: 298.15 k
press: 1.00 atm
thermalcorrenthalpy: 0.00094421 hartree
totalenthalpy: -701.11967388 hartree
totalentropycorr: -0.05035657 hartree
gibbsenthalpy: -701.17003044 hartree
gibbsminuselec: 0.17121330 hartree
chargesum: 1.0000000
charge: -0.198177 0.204469 -0.094282 0.357245 0.162437 0.128480 -0.413544 0.186942 -0.096307 -0.288857 -0.193312 0.161885 0.146352 0.194708 0.266723 -0.182968 -0.383251 0.167898 0.181176 -0.228747 0.245983 -0.049854 0.254437 0.236424 0.234141
charge: 0.321145 -0.006255 -0.044561 -0.402275 0.043757 0.030770 0.092836 -0.395942 -0.010789 0.121026 0.348965 0.040050 0.034242 -0.006058 -0.410550 0.032769 0.095034 0.032520 0.040075 0.409045 -0.069612 0.609385 0.007632 0.042363 0.044429
qa: -0.1982 0.2045 -0.0943 0.3572 0.1624 0.1285 -0.4135 0.1869 -0.0963 -0.2889 -0.1933 0.1619 0.1464 0.1947 0.2667 -0.1830 -0.3833 0.1679 0.1812 -0.2287 0.2460 -0.0499 0.2544 0.2364 0.2341
va: 3.0865 1.0083 3.8294 4.1695 0.9946 1.0303 2.0278 4.3385 3.7199 2.2265 3.2214 1.0073 1.0118 1.0027 4.2025 3.8443 2.1249 1.0032 0.9917 2.2824 1.0133 3.6016 1.0154 1.0057 0.9710
dispcorr: -0.045101923 hartree
energy: -701.345086247249
dipole: 6.82083 -3.36182 3.45901 -3.84039 1.15962 -2.68077 2.65574 -2.50141 0.15432
magnitude: 4.37894 au
magnitude: 11.13038 debye
zeropoint: 0.20981449 hartree
thermalvibcorrection: 0.01052787 hartree
thermalrotcorrection: 0.00141627 hartree
thermaltrasncorrection: 0.00141627 hartree
thermaltotal: -701.12191134 hartree
thermalcorr: 0.01336041 hartree
nonthermalcorr: 0.20981449 hartree
totalcorr: 0.22317491 hartree
totalenthalpy: -701.12096713 hartree
