program: Orca
programVersion: 5.0.2
elementType: N H C C H H O C C O N H H H C C O H H O H N H H H
charge: 1
multiplicity: 1
keywords: wB97X-D3BJ Opt Freq def2-TZVPP def2/J RIJCOSX VeryTightSCF
keywords: PAL8 defgrid3 VeryTightOpt
frequency: 0.00 0.00 0.00 0.00 0.00 0.00 23.53 40.63 52.89 57.67 78.48 92.87 112.15 209.46 232.16 278.74 285.11 334.35 391.84 418.13 460.99 512.52 526.66 548.03 594.93 603.61 605.70 626.24 660.05 713.09 723.63 850.98 875.87 891.70 932.86 989.49 1022.56 1050.62 1110.42 1117.53 1127.38 1140.45 1200.27 1269.18 1288.67 1313.99 1323.61 1324.76 1360.71 1379.38 1386.81 1435.65 1443.70 1474.23 1488.37 1501.57 1504.15 1604.77 1649.71 1667.81 1785.55 1808.32 1898.26 2903.14 3106.71 3119.81 3131.06 3156.58 3173.11 3194.36 3513.22 3574.47 3641.99 3654.22 3820.01
frequency: 23.53 40.63 52.89 57.67 78.48 92.87 112.15 209.46 232.16 278.74 285.11 334.35 391.84 418.13 460.99 512.52 526.66 548.03 594.93 603.61 605.70 626.24 660.05 713.09 723.63 850.98 875.87 891.70 932.86 989.49 1022.56 1050.62 1110.42 1117.53 1127.38 1140.45 1200.27 1269.18 1288.67 1313.99 1323.61 1324.76 1360.71 1379.38 1386.81 1435.65 1443.70 1474.23 1488.37 1501.57 1504.15 1604.77 1649.71 1667.81 1785.55 1808.32 1898.26 2903.14 3106.71 3119.81 3131.06 3156.58 3173.11 3194.36 3513.22 3574.47 3641.99 3654.22 3820.01
formula: C6H12N3O4
InChI: InChI=1S/C6H12N3O4/c7-1-4(10)8-2-5(11)9-3-6(12)13/h8-9,12H,1-3H2,7H3
25 atoms
N  -1.06401 2.466656 2.53353
H  -0.962841 2.512756 3.535871
C  -2.053921 3.313753 1.888979
C  -1.495596 4.198697 0.770956
H  -2.8844 2.746591 1.467594
H  -2.473749 3.977688 2.645956
O  -2.164067 4.536033 -0.158565
C  -0.471641 1.383228 1.961982
C  -0.722836 1.180131 0.458066
O  0.23931 0.618048 2.580811
N  -0.006485 -0.000444 0.017358
H  -0.371104 2.042677 -0.107667
H  -1.784713 1.053762 0.248423
H  -0.448615 -0.89126 0.178128
C  1.326538 0.03369 -0.009619
C  2.067222 -1.31333 -0.056987
O  2.010409 1.04868 -0.013122
H  1.817741 -1.888126 -0.946812
H  1.854359 -1.900272 0.834632
O  -0.210452 4.572799 0.898954
H  0.168804 4.194636 1.701113
N  3.509721 -0.926275 -0.080105
H  4.000793 -1.239009 -0.914655
H  3.439798 0.132627 -0.070812
H  4.021431 -1.244558 0.740127
totalener: -701.28175607 hartree
nucrepener: 847.31446885 hartree
electener: -1548.59622492 hartree
oneelecener: -2623.38369749 hartree
twoeener: 1074.78747257 hartree
kineticenergy: 697.93204993 hartree
exchangeener: -60.036281402091 hartree
correlationener: -4.264263658098 hartree
xcener: -64.300545060189 hartree
temp: 298.15 k
press: 1.00 atm
thermalcorrenthalpy: 0.00094421 hartree
totalenthalpy: -701.10483951 hartree
totalentropycorr: -0.05116619 hartree
gibbsenthalpy: -701.15600570 hartree
gibbsminuselec: 0.16874522 hartree
totalenthalpy: -701.10582666 hartree
chargesum: 1.0000000
charge: -0.250322 0.211124 -0.108610 0.240702 0.134637 0.142803 -0.254409 0.237730 -0.097767 -0.346820 -0.192379 0.160853 0.156149 0.185945 0.289870 -0.170332 -0.352584 0.179144 0.175964 -0.219797 0.216327 -0.050314 0.238054 0.234145 0.239889
charge: 0.315691 -0.010341 -0.050149 -0.462793 0.032855 0.043715 0.153712 -0.386822 -0.020834 0.087890 0.349080 0.043092 0.037426 -0.003306 -0.371292 0.045424 0.143377 0.037578 0.040506 0.380429 -0.111230 0.604763 0.048418 0.002377 0.050436
qa: -0.2503 0.2111 -0.1086 0.2407 0.1346 0.1428 -0.2544 0.2377 -0.0978 -0.3468 -0.1924 0.1609 0.1561 0.1859 0.2899 -0.1703 -0.3526 0.1791 0.1760 -0.2198 0.2163 -0.0503 0.2381 0.2341 0.2399
va: 3.0855 0.9965 3.8137 4.3350 1.0121 0.9915 2.2557 4.2776 3.7745 2.1744 3.3050 1.0119 0.9948 1.0102 4.2082 3.8122 2.1678 0.9931 0.9959 2.2070 1.0326 3.5975 0.9714 1.0464 0.9712
dispcorr: -0.043304210 hartree
energy: -701.328763336066
dipole: 4.66104 -1.39247 3.26857 -9.34826 4.55817 -4.79009 -0.56586 0.40986 -0.15600
magnitude: 5.80111 au
magnitude: 14.74524 debye
zeropoint: 0.20820505 hartree
thermalvibcorrection: 0.01095654 hartree
thermalrotcorrection: 0.00141627 hartree
thermaltrasncorrection: 0.00141627 hartree
thermaltotal: -701.10676920 hartree
thermalcorr: 0.01378908 hartree
nonthermalcorr: 0.20820505 hartree
totalcorr: 0.22199413 hartree
totalenthalpy: -701.10582499 hartree
