program: Orca
programVersion: 5.0.2
elementType: N H C C H H O C C O N H H H C C O H H O H N H H H
charge: 1
multiplicity: 1
keywords: wB97X-D3BJ Opt Freq def2-TZVPP def2/J RIJCOSX VeryTightSCF
keywords: PAL8 defgrid3 VeryTightOpt
frequency: 0.00 0.00 0.00 0.00 0.00 0.00 19.64 23.79 30.24 69.22 85.39 133.61 168.37 219.29 246.15 287.50 330.73 355.05 387.38 454.67 495.11 516.12 518.71 534.45 567.59 592.51 621.12 666.42 674.50 697.25 759.39 827.12 859.80 904.76 919.38 975.92 1029.66 1058.40 1119.92 1131.84 1147.24 1172.27 1195.54 1267.54 1300.31 1341.01 1352.43 1366.61 1387.13 1394.96 1412.62 1444.08 1464.82 1480.42 1507.05 1515.38 1530.10 1618.19 1643.08 1728.50 1741.12 1812.44 1888.36 2508.53 3091.38 3126.70 3128.89 3156.38 3182.03 3195.52 3498.37 3559.06 3634.20 3673.47 3791.84
frequency: 19.64 23.79 30.24 69.22 85.39 133.61 168.37 219.29 246.15 287.50 330.73 355.05 387.38 454.67 495.11 516.12 518.71 534.45 567.59 592.51 621.12 666.42 674.50 697.25 759.39 827.12 859.80 904.76 919.38 975.92 1029.66 1058.40 1119.92 1131.84 1147.24 1172.27 1195.54 1267.54 1300.31 1341.01 1352.43 1366.61 1387.13 1394.96 1412.62 1444.08 1464.82 1480.42 1507.05 1515.38 1530.10 1618.19 1643.08 1728.50 1741.12 1812.44 1888.36 2508.53 3091.38 3126.70 3128.89 3156.38 3182.03 3195.52 3498.37 3559.06 3634.20 3673.47 3791.84
formula: C6H12N3O4
InChI: InChI=1S/C6H12N3O4/c7-1-4(10)8-2-5(11)9-3-6(12)13/h8-9,12H,1-3H2,7H3
25 atoms
N  -1.246493 -1.508205 -2.564014
H  -1.804786 -0.671214 -2.556392
C  -0.876529 -2.088912 -3.841658
C  0.485438 -1.651755 -4.366158
H  -1.621123 -1.81592 -4.588296
H  -0.863516 -3.175142 -3.765809
O  0.955556 -2.086651 -5.373556
C  -0.676216 -1.910917 -1.434245
C  -0.942408 -1.102941 -0.168197
O  0.083893 -2.889683 -1.393583
N  0.018086 -0.02582 0.012801
H  -1.929393 -0.644161 -0.209802
H  -0.961846 -1.794006 0.67748
H  -0.350514 0.913309 -0.005237
C  1.386644 -0.006191 0.044278
C  2.251338 -1.271891 0.036922
O  1.992007 1.038415 0.051821
H  3.148811 -1.014694 0.593741
H  2.523011 -1.481768 -0.99798
O  1.086059 -0.721666 -3.590744
H  1.90156 -0.465489 -4.044004
N  1.668067 -2.531512 0.593651
H  2.390555 -3.246768 0.664475
H  1.277518 -2.398706 1.524196
H  0.922761 -2.870866 -0.109513
totalener: -701.28399954 hartree
nucrepener: 873.41048073 hartree
electener: -1574.69448026 hartree
oneelecener: -2674.53882260 hartree
twoeener: 1099.84434233 hartree
kineticenergy: 697.93438559 hartree
exchangeener: -60.037576137041 hartree
correlationener: -4.263854144195 hartree
xcener: -64.301430281237 hartree
temp: 298.15 k
press: 1.00 atm
thermalcorrenthalpy: 0.00094421 hartree
totalenthalpy: -701.10775344 hartree
totalentropycorr: -0.05082399 hartree
gibbsenthalpy: -701.15857743 hartree
gibbsminuselec: 0.16929095 hartree
totalenthalpy: -701.10845768 hartree
chargesum: 1.0000000
charge: -0.157877 0.197868 -0.066534 0.276800 0.146277 0.147928 -0.256270 0.315288 -0.176482 -0.392106 -0.186818 0.141409 0.132005 0.205974 0.206514 -0.162073 -0.280275 0.187226 0.162774 -0.286625 0.240517 -0.070594 0.235245 0.218769 0.221059
charge: 0.361767 -0.003791 -0.018046 -0.436506 0.045248 0.047246 0.155045 -0.349190 -0.046026 0.153538 0.315177 0.041803 0.025758 -0.001776 -0.396778 0.023697 0.140123 0.044323 0.040963 0.343711 -0.080445 0.582871 0.047209 0.036229 -0.072151
qa: -0.1579 0.1979 -0.0665 0.2768 0.1463 0.1479 -0.2563 0.3153 -0.1765 -0.3921 -0.1868 0.1414 0.1320 0.2060 0.2065 -0.1621 -0.2803 0.1872 0.1628 -0.2866 0.2405 -0.0706 0.2352 0.2188 0.2211
va: 3.2756 1.0014 3.7760 4.3147 1.0000 1.0156 2.2522 4.0782 3.8900 2.1247 3.0705 1.0021 0.9994 1.0063 4.3346 3.7727 2.2335 1.0059 1.0046 2.1535 1.0151 3.5299 0.9688 0.9791 1.1000
dispcorr: -0.044074600 hartree
energy: -701.331411091263
dipole: -1.32683 0.64275 -0.68408 -2.89527 1.86360 -1.03167 7.00665 -4.19634 2.81031
magnitude: 3.07085 au
magnitude: 7.80549 debye
zeropoint: 0.20854023 hartree
thermalvibcorrection: 0.01064509 hartree
thermalrotcorrection: 0.00141627 hartree
thermaltrasncorrection: 0.00141627 hartree
thermaltotal: -701.10939323 hartree
thermalcorr: 0.01347763 hartree
nonthermalcorr: 0.20854023 hartree
totalcorr: 0.22201786 hartree
totalenthalpy: -701.10844902 hartree
