program: Orca
programVersion: 5.0.2
elementType: N H C C H H O C C O N H H H C C O H H O H N H H H
charge: 1
multiplicity: 1
keywords: wB97X-D3BJ Opt Freq def2-TZVPP def2/J RIJCOSX VeryTightSCF
keywords: PAL8 defgrid3 VeryTightOpt
frequency: 0.00 0.00 0.00 0.00 0.00 0.00 19.46 40.12 48.40 72.28 85.99 111.71 180.71 203.89 229.61 264.93 318.69 359.66 398.36 453.66 471.27 489.44 505.26 537.39 582.82 603.45 646.53 657.25 671.74 717.48 746.13 831.36 896.44 914.12 971.20 1013.57 1020.12 1039.59 1131.64 1151.53 1157.85 1177.21 1206.26 1262.73 1263.90 1293.00 1318.31 1349.85 1384.80 1410.25 1435.88 1445.78 1479.47 1499.15 1508.08 1516.05 1577.57 1608.93 1651.82 1700.04 1753.51 1809.13 1880.77 2211.78 3083.36 3098.60 3127.16 3130.28 3158.81 3186.70 3502.96 3561.44 3564.16 3628.20 3849.34
frequency: 19.46 40.12 48.40 72.28 85.99 111.71 180.71 203.89 229.61 264.93 318.69 359.66 398.36 453.66 471.27 489.44 505.26 537.39 582.82 603.45 646.53 657.25 671.74 717.48 746.13 831.36 896.44 914.12 971.20 1013.57 1020.12 1039.59 1131.64 1151.53 1157.85 1177.21 1206.26 1262.73 1263.90 1293.00 1318.31 1349.85 1384.80 1410.25 1435.88 1445.78 1479.47 1499.15 1508.08 1516.05 1577.57 1608.93 1651.82 1700.04 1753.51 1809.13 1880.77 2211.78 3083.36 3098.60 3127.16 3130.28 3158.81 3186.70 3502.96 3561.44 3564.16 3628.20 3849.34
formula: C6H12N3O4
InChI: InChI=1S/C6H12N3O4/c7-1-4(10)8-2-5(11)9-3-6(12)13/h8-9,12H,1-3H2,7H3
25 atoms
N  -2.231393 -1.45545 2.084729
H  -2.970304 -0.855789 1.734216
C  -2.483474 -1.99226 3.406581
C  -3.847102 -1.462169 3.843386
H  -2.489984 -3.08504 3.386301
H  -1.709359 -1.672112 4.108789
O  -4.4954 -0.74344 3.136717
C  -1.140434 -1.71306 1.389197
C  -1.000607 -1.055576 0.01782
O  -0.235997 -2.452198 1.82231
N  0.00222 -0.008502 0.009395
H  -1.94304 -0.603494 -0.287751
H  -0.790436 -1.833331 -0.719299
H  -0.344356 0.939492 0.028696
C  1.369339 -0.017455 0.007516
C  2.246611 -1.275985 0.029438
O  1.993828 1.015804 -0.002016
H  2.858214 -1.179542 0.925139
H  2.905589 -1.207424 -0.834445
O  -4.273867 -1.840898 5.046646
H  -3.6464 -2.415171 5.498486
N  1.620694 -2.631763 0.066248
H  2.32487 -3.328144 0.3050
H  0.832387 -2.651936 0.832016
H  1.234522 -2.898899 -0.835949
totalener: -701.28264261 hartree
nucrepener: 823.34748603 hartree
electener: -1524.63012864 hartree
oneelecener: -2574.56998855 hartree
twoeener: 1049.93985990 hartree
kineticenergy: 697.91838929 hartree
exchangeener: -60.038397902414 hartree
correlationener: -4.263915803575 hartree
xcener: -64.302313705989 hartree
temp: 298.15 k
press: 1.00 atm
thermalcorrenthalpy: 0.00094421 hartree
totalenthalpy: -701.10530508 hartree
totalentropycorr: -0.05115957 hartree
gibbsenthalpy: -701.15646465 hartree
gibbsminuselec: 0.16786011 hartree
totalenthalpy: -701.10548036 hartree
chargesum: 1.0000000
charge: -0.135123 0.196014 -0.135123 0.328760 0.142468 0.144569 -0.291897 0.316197 -0.168227 -0.404338 -0.187635 0.138648 0.130225 0.210025 0.220453 -0.152356 -0.288098 0.170929 0.171377 -0.199626 0.222251 -0.085309 0.230054 0.218015 0.207747
charge: 0.367473 -0.010704 -0.029289 -0.432324 0.036363 0.036689 0.148580 -0.340312 -0.045616 0.157078 0.318180 0.042192 0.025577 0.001513 -0.392908 0.017782 0.139188 0.048712 0.043783 0.409115 -0.089060 0.569858 0.041634 -0.091536 0.028033
qa: -0.1351 0.1960 -0.1351 0.3288 0.1425 0.1446 -0.2919 0.3162 -0.1682 -0.4043 -0.1876 0.1386 0.1302 0.2100 0.2205 -0.1524 -0.2881 0.1709 0.1714 -0.1996 0.2223 -0.0853 0.2301 0.2180 0.2077
va: 3.2815 1.0396 3.8694 4.3105 0.9952 0.9962 2.2013 4.0719 3.9093 2.1234 3.0615 1.0090 0.9965 1.0051 4.3449 3.8011 2.2377 0.9980 1.0012 2.2889 1.0206 3.5063 0.9712 1.1150 0.9849
dispcorr: -0.042136223 hartree
energy: -701.327699517658
dipole: 7.27913 -5.12240 2.15673 -5.70616 2.90650 -2.79967 -4.98737 3.56105 -1.42632
magnitude: 3.81104 au
magnitude: 9.68688 debye
zeropoint: 0.20772100 hartree
thermalvibcorrection: 0.01065728 hartree
thermalrotcorrection: 0.00141627 hartree
thermaltrasncorrection: 0.00141627 hartree
thermaltotal: -701.10648870 hartree
thermalcorr: 0.01348982 hartree
nonthermalcorr: 0.20772100 hartree
totalcorr: 0.22121082 hartree
totalenthalpy: -701.10554449 hartree
