program: Orca
programVersion: 5.0.2
elementType: N H C C H H O C C O N H H H C C O H H O H N H H H
charge: 1
multiplicity: 1
keywords: wB97X-D3BJ Opt Freq def2-TZVPP def2/J RIJCOSX VeryTightSCF
keywords: PAL8 defgrid3 VeryTightOpt
frequency: 0.00 0.00 0.00 0.00 0.00 0.00 25.88 59.00 74.46 77.41 110.54 144.14 171.86 203.80 226.39 275.72 304.11 323.77 344.22 410.18 439.69 498.19 514.19 541.05 579.51 591.23 637.78 669.69 727.40 745.90 757.84 825.54 869.99 895.43 906.90 991.72 1017.32 1027.62 1112.41 1131.40 1161.38 1181.38 1205.48 1273.68 1293.51 1300.48 1327.91 1346.75 1370.55 1396.64 1458.97 1470.55 1477.49 1492.45 1500.89 1505.78 1518.71 1536.80 1618.97 1687.17 1750.41 1809.60 1892.84 3059.15 3078.09 3104.13 3137.44 3162.31 3219.16 3287.69 3424.70 3545.16 3554.02 3625.16 3853.92
frequency: 25.88 59.00 74.46 77.41 110.54 144.14 171.86 203.80 226.39 275.72 304.11 323.77 344.22 410.18 439.69 498.19 514.19 541.05 579.51 591.23 637.78 669.69 727.40 745.90 757.84 825.54 869.99 895.43 906.90 991.72 1017.32 1027.62 1112.41 1131.40 1161.38 1181.38 1205.48 1273.68 1293.51 1300.48 1327.91 1346.75 1370.55 1396.64 1458.97 1470.55 1477.49 1492.45 1500.89 1505.78 1518.71 1536.80 1618.97 1687.17 1750.41 1809.60 1892.84 3059.15 3078.09 3104.13 3137.44 3162.31 3219.16 3287.69 3424.70 3545.16 3554.02 3625.16 3853.92
formula: C6H12N3O4
InChI: InChI=1S/C6H12N3O4/c7-1-4(10)8-2-5(11)9-3-6(12)13/h8-9,12H,1-3H2,7H3
25 atoms
N  -1.383312 -1.85247 -2.857286
H  -1.107843 -2.114616 -3.798988
C  -2.770942 -2.122956 -2.548703
C  -3.377736 -2.821793 -3.768522
H  -2.877235 -2.781507 -1.681313
H  -3.333962 -1.203329 -2.358984
O  -2.733799 -3.056394 -4.74787
C  -0.451453 -1.323735 -2.063585
C  -0.847659 -1.011167 -0.613022
O  0.702117 -1.131083 -2.448324
N  -0.004878 -0.000617 -0.011803
H  -0.814446 -1.947476 -0.047111
H  -1.87583 -0.658898 -0.553595
H  -0.367037 0.942109 -0.000616
C  1.346894 -0.032184 0.023398
C  2.073406 -1.379229 -0.024335
O  2.047465 0.956037 0.108947
H  1.463396 -2.249189 -0.241776
H  2.611954 -1.512759 0.912936
O  -4.667369 -3.152415 -3.672858
H  -5.056691 -2.893282 -2.831331
N  3.059715 -1.204056 -1.13119
H  3.760766 -1.94054 -1.173929
H  2.499288 -1.175248 -1.999886
H  3.51139 -0.292009 -0.998864
totalener: -701.28849557 hartree
nucrepener: 830.71421425 hartree
electener: -1532.00270982 hartree
oneelecener: -2589.52462218 hartree
twoeener: 1057.52191236 hartree
kineticenergy: 697.94449421 hartree
exchangeener: -60.044399296069 hartree
correlationener: -4.265512717866 hartree
xcener: -64.309912013935 hartree
temp: 298.15 k
press: 1.00 atm
thermalcorrenthalpy: 0.00094421 hartree
totalenthalpy: -701.11041599 hartree
totalentropycorr: -0.05097449 hartree
gibbsenthalpy: -701.16139048 hartree
gibbsminuselec: 0.17018476 hartree
chargesum: 1.0000000
charge: -0.146560 0.208400 -0.169419 0.314699 0.136627 0.138524 -0.275130 0.303985 -0.117416 -0.451347 -0.177488 0.134126 0.133710 0.200407 0.226239 -0.151973 -0.331261 0.146598 0.176063 -0.201671 0.218150 -0.042549 0.232923 0.255743 0.238620
charge: 0.351140 -0.001643 -0.051035 -0.432168 0.028242 0.028589 0.159704 -0.369268 -0.043292 0.072111 0.333564 0.034936 0.035612 0.002204 -0.399189 0.033226 0.112284 0.024891 0.040863 0.404947 -0.093217 0.611592 0.046003 0.016797 0.053108
qa: -0.1466 0.2084 -0.1694 0.3147 0.1366 0.1385 -0.2751 0.3040 -0.1174 -0.4513 -0.1775 0.1341 0.1337 0.2004 0.2262 -0.1520 -0.3313 0.1466 0.1761 -0.2017 0.2182 -0.0425 0.2329 0.2557 0.2386
va: 3.2141 1.0314 3.8910 4.3517 0.9817 0.9839 2.2193 4.1400 3.8931 2.0361 3.1699 0.9917 1.0004 1.0064 4.3267 3.8961 2.1797 1.0047 1.0000 2.2824 1.0242 3.5966 0.9701 1.0096 0.9960
dispcorr: -0.043387130 hartree
energy: -701.335106499027
dipole: 4.47022 -2.71595 1.75427 -0.90517 0.40855 -0.49662 6.88331 -4.47429 2.40902
magnitude: 3.02117 au
magnitude: 7.67921 debye
zeropoint: 0.20927611 hartree
thermalvibcorrection: 0.01060459 hartree
thermalrotcorrection: 0.00141627 hartree
thermaltrasncorrection: 0.00141627 hartree
thermaltotal: -701.11239325 hartree
thermalcorr: 0.01343713 hartree
nonthermalcorr: 0.20927611 hartree
totalcorr: 0.22271324 hartree
totalenthalpy: -701.11144905 hartree
