program: Orca
programVersion: 5.0.2
elementType: N H C C H H O C C O N H H H C C O H H O H N H H H
charge: 1
multiplicity: 1
keywords: wB97X-D3BJ Opt Freq def2-TZVPP def2/J RIJCOSX VeryTightSCF
keywords: PAL8 defgrid3 VeryTightOpt
frequency: 0.00 0.00 0.00 0.00 0.00 0.00 51.05 54.24 62.20 87.43 117.55 143.79 168.98 220.89 293.55 295.49 318.51 336.94 367.46 421.31 487.94 507.92 528.22 540.38 577.37 639.63 666.73 682.93 727.69 762.10 788.58 824.18 876.95 890.43 892.74 973.21 1007.25 1024.16 1112.84 1134.80 1152.80 1157.84 1202.27 1268.59 1291.10 1328.70 1337.67 1356.94 1380.24 1454.84 1463.27 1471.44 1476.40 1489.94 1496.93 1508.66 1515.69 1533.27 1622.95 1690.45 1745.01 1805.50 1847.01 3099.08 3119.32 3141.66 3169.38 3204.45 3223.26 3230.09 3434.74 3555.37 3593.16 3632.48 3791.15
frequency: 51.05 54.24 62.20 87.43 117.55 143.79 168.98 220.89 293.55 295.49 318.51 336.94 367.46 421.31 487.94 507.92 528.22 540.38 577.37 639.63 666.73 682.93 727.69 762.10 788.58 824.18 876.95 890.43 892.74 973.21 1007.25 1024.16 1112.84 1134.80 1152.80 1157.84 1202.27 1268.59 1291.10 1328.70 1337.67 1356.94 1380.24 1454.84 1463.27 1471.44 1476.40 1489.94 1496.93 1508.66 1515.69 1533.27 1622.95 1690.45 1745.01 1805.50 1847.01 3099.08 3119.32 3141.66 3169.38 3204.45 3223.26 3230.09 3434.74 3555.37 3593.16 3632.48 3791.15
formula: C6H12N3O4
InChI: InChI=1S/C6H12N3O4/c7-1-4(10)8-2-5(11)9-3-6(12)13/h8-9,12H,1-3H2,7H3
25 atoms
N  -1.624226 -0.937528 -2.95804
H  -1.361524 -0.971234 -3.932008
C  -2.962743 -0.482404 -2.648558
C  -2.988085 0.946562 -2.118587
H  -3.567823 -0.54201 -3.551406
H  -3.451438 -1.124223 -1.911401
O  -2.037204 1.506202 -1.636744
C  -0.588941 -1.050062 -2.113647
C  -0.826905 -0.984228 -0.602461
O  0.554332 -1.238174 -2.533756
N  0.02584 0.024745 -0.004236
H  -0.611368 -1.972508 -0.194355
H  -1.853236 -0.752309 -0.33923
H  -0.337201 0.968069 -0.068423
C  1.37669 -0.019846 -0.018997
C  2.087801 -1.376867 -0.074288
O  2.094931 0.959878 0.00683
H  1.456852 -2.250746 -0.19166
H  2.715239 -1.470101 0.810509
O  -4.205904 1.470354 -2.220997
H  -4.19887 2.360958 -1.84226
N  2.959038 -1.267795 -1.282383
H  3.436636 -0.361362 -1.241745
H  2.306114 -1.274356 -2.088627
H  3.641072 -2.018939 -1.359667
totalener: -701.30244644 hartree
nucrepener: 867.65377286 hartree
electener: -1568.95621930 hartree
oneelecener: -2663.72934603 hartree
twoeener: 1094.77312673 hartree
kineticenergy: 697.97149475 hartree
exchangeener: -60.049845019662 hartree
correlationener: -4.266946876863 hartree
xcener: -64.316791896525 hartree
temp: 298.15 k
press: 1.00 atm
thermalcorrenthalpy: 0.00094421 hartree
totalenthalpy: -701.12538558 hartree
totalentropycorr: -0.05035116 hartree
gibbsenthalpy: -701.17573674 hartree
gibbsminuselec: 0.17149299 hartree
chargesum: 1.0000000
charge: -0.156268 0.200658 -0.116981 0.325802 0.151747 0.141012 -0.332454 0.319939 -0.099746 -0.465688 -0.169747 0.129057 0.126086 0.214405 0.209590 -0.152925 -0.331588 0.147493 0.177555 -0.242731 0.251224 -0.046824 0.236885 0.252807 0.230693
charge: 0.350117 0.002489 -0.038728 -0.439523 0.045819 0.038822 0.116588 -0.350564 -0.036859 0.075275 0.335011 0.032208 0.030734 0.001489 -0.400391 0.033348 0.109966 0.022024 0.040093 0.392830 -0.070250 0.608721 0.051867 0.004574 0.044337
qa: -0.1563 0.2007 -0.1170 0.3258 0.1517 0.1410 -0.3325 0.3199 -0.0997 -0.4657 -0.1697 0.1291 0.1261 0.2144 0.2096 -0.1529 -0.3316 0.1475 0.1776 -0.2427 0.2512 -0.0468 0.2369 0.2528 0.2307
va: 3.2078 1.0057 3.8536 4.2468 1.0066 0.9975 2.1416 4.1536 3.9198 2.0374 3.1391 1.0033 1.0125 1.0113 4.3388 3.8988 2.1768 1.0089 0.9993 2.2642 1.0078 3.5883 0.9958 1.0201 0.9713
dispcorr: -0.044967914 hartree
energy: -701.350730092027
dipole: 3.43531 -2.24248 1.19282 -6.86276 4.65636 -2.20641 0.96542 -1.15788 -0.19246
magnitude: 2.51557 au
magnitude: 6.39407 debye
zeropoint: 0.21045047 hartree
thermalvibcorrection: 0.01023731 hartree
thermalrotcorrection: 0.00141627 hartree
thermaltrasncorrection: 0.00141627 hartree
thermaltotal: -701.12720977 hartree
thermalcorr: 0.01306985 hartree
nonthermalcorr: 0.21045047 hartree
totalcorr: 0.22352032 hartree
totalenthalpy: -701.12626556 hartree
