program: Orca
programVersion: 5.0.2
elementType: N H C C H H O C C O N H H H C C O H H O H N H H H
charge: 1
multiplicity: 1
keywords: wB97X-D3BJ Opt Freq def2-TZVPP def2/J RIJCOSX VeryTightSCF
keywords: PAL8 defgrid3 VeryTightOpt
frequency: 0.00 0.00 0.00 0.00 0.00 0.00 26.14 58.73 73.76 75.36 109.68 142.85 171.71 203.31 223.56 274.92 303.62 323.96 346.90 412.75 496.20 512.35 532.44 540.84 577.58 628.11 656.38 665.03 722.62 739.89 757.00 825.65 868.79 895.68 916.02 991.66 1017.32 1029.90 1112.49 1131.82 1161.83 1177.26 1210.37 1265.04 1294.32 1317.00 1328.28 1352.06 1376.09 1421.91 1469.77 1473.92 1475.98 1491.27 1501.17 1502.78 1519.04 1539.43 1618.38 1687.31 1749.87 1809.08 1864.91 3079.57 3079.68 3125.25 3137.81 3164.19 3219.10 3276.70 3425.68 3555.05 3563.08 3625.69 3794.95
frequency: 26.14 58.73 73.76 75.36 109.68 142.85 171.71 203.31 223.56 274.92 303.62 323.96 346.90 412.75 496.20 512.35 532.44 540.84 577.58 628.11 656.38 665.03 722.62 739.89 757.00 825.65 868.79 895.68 916.02 991.66 1017.32 1029.90 1112.49 1131.82 1161.83 1177.26 1210.37 1265.04 1294.32 1317.00 1328.28 1352.06 1376.09 1421.91 1469.77 1473.92 1475.98 1491.27 1501.17 1502.78 1519.04 1539.43 1618.38 1687.31 1749.87 1809.08 1864.91 3079.57 3079.68 3125.25 3137.81 3164.19 3219.10 3276.70 3425.68 3555.05 3563.08 3625.69 3794.95
formula: C6H12N3O4
InChI: InChI=1S/C6H12N3O4/c7-1-4(10)8-2-5(11)9-3-6(12)13/h8-9,12H,1-3H2,7H3
25 atoms
N  -1.399645 -1.831094 2.852409
H  -1.1297 -2.079685 3.798116
C  -2.78589 -2.093624 2.522774
C  -3.425511 -2.771582 3.722986
H  -3.345032 -1.176994 2.317022
H  -2.891271 -2.757659 1.6616
O  -2.837305 -3.009262 4.741866
C  -0.46034 -1.31086 2.063139
C  -0.849155 -1.005607 0.608992
O  0.692169 -1.119208 2.454399
N  -0.001208 -0.000364 0.005865
H  -1.876248 -0.65165 0.543514
H  -0.817063 -1.944857 0.04813
H  -0.361265 0.942992 -0.01371
C  1.349628 -0.037695 -0.028836
C  2.069304 -1.387956 0.031114
O  2.055783 0.946316 -0.120666
H  2.613825 -1.529203 -0.901488
H  1.453407 -2.253653 0.249102
O  -4.704488 -3.053141 3.484067
H  -5.080548 -3.475557 4.269191
N  3.047673 -1.210946 1.144616
H  3.505914 -0.302702 1.00974
H  2.477536 -1.172591 2.00739
H  3.743529 -1.951439 1.198815
totalener: -701.30054185 hartree
nucrepener: 830.66377223 hartree
electener: -1531.96431408 hartree
oneelecener: -2589.69142360 hartree
twoeener: 1057.72710952 hartree
kineticenergy: 697.95843548 hartree
exchangeener: -60.048633763718 hartree
correlationener: -4.265753544967 hartree
xcener: -64.314387308684 hartree
temp: 298.15 k
press: 1.00 atm
thermalcorrenthalpy: 0.00094421 hartree
totalenthalpy: -701.12208224 hartree
totalentropycorr: -0.05094484 hartree
gibbsenthalpy: -701.17302707 hartree
gibbsminuselec: 0.17046621 hartree
chargesum: 1.0000000
charge: -0.147561 0.207028 -0.104785 0.287150 0.141426 0.140333 -0.298969 0.307210 -0.116922 -0.453965 -0.175965 0.137046 0.134440 0.200581 0.225144 -0.152170 -0.332717 0.175770 0.146396 -0.252810 0.250990 -0.043120 0.238173 0.255185 0.232114
charge: 0.351933 -0.000688 -0.036066 -0.435912 0.034738 0.034227 0.134329 -0.368572 -0.041941 0.070002 0.334388 0.037011 0.035146 0.002353 -0.399715 0.033231 0.110759 0.040624 0.024873 0.386195 -0.070397 0.611096 0.052724 0.014358 0.045305
qa: -0.1476 0.2070 -0.1048 0.2871 0.1414 0.1403 -0.2990 0.3072 -0.1169 -0.4540 -0.1760 0.1370 0.1344 0.2006 0.2251 -0.1522 -0.3327 0.1758 0.1464 -0.2528 0.2510 -0.0431 0.2382 0.2552 0.2321
va: 3.2150 1.0274 3.8579 4.3733 0.9941 0.9920 2.1928 4.1370 3.8869 2.0325 3.1698 1.0009 0.9922 1.0062 4.3288 3.8949 2.1787 1.0002 1.0049 2.2463 1.0079 3.5946 0.9962 1.0117 0.9705
dispcorr: -0.043252104 hartree
energy: -701.346965791182
dipole: 4.57159 -2.88388 1.68771 -1.57889 0.59371 -0.98517 -5.40232 4.05749 -1.34482
magnitude: 2.37223 au
magnitude: 6.02973 debye
zeropoint: 0.20963429 hartree
thermalvibcorrection: 0.01052184 hartree
thermalrotcorrection: 0.00141627 hartree
thermaltrasncorrection: 0.00141627 hartree
thermaltotal: -701.12397712 hartree
thermalcorr: 0.01335439 hartree
nonthermalcorr: 0.20963429 hartree
totalcorr: 0.22298867 hartree
totalenthalpy: -701.12303291 hartree
