program: Orca
programVersion: 5.0.2
elementType: N H C C H H O C C O N H H H C C O H H O H N H H H
charge: 1
multiplicity: 1
keywords: wB97X-D3BJ Opt Freq def2-TZVPP def2/J RIJCOSX VeryTightSCF
keywords: PAL8 defgrid3 VeryTightOpt
frequency: 0.00 0.00 0.00 0.00 0.00 0.00 33.28 53.91 61.50 69.33 94.15 156.50 177.82 241.17 242.41 261.43 300.79 310.88 350.64 436.95 451.74 512.04 535.77 545.84 572.62 606.22 632.25 658.54 702.71 722.78 755.12 826.90 836.66 904.37 911.55 985.37 1013.30 1031.08 1120.94 1132.95 1152.37 1166.59 1220.25 1259.50 1290.20 1338.67 1355.00 1373.99 1382.20 1419.08 1443.64 1467.78 1482.57 1489.73 1493.70 1502.09 1508.25 1537.28 1608.18 1688.69 1785.12 1796.60 1824.01 3114.33 3118.12 3132.72 3170.17 3180.32 3230.03 3293.63 3365.33 3558.91 3609.55 3640.30 3791.10
frequency: 33.28 53.91 61.50 69.33 94.15 156.50 177.82 241.17 242.41 261.43 300.79 310.88 350.64 436.95 451.74 512.04 535.77 545.84 572.62 606.22 632.25 658.54 702.71 722.78 755.12 826.90 836.66 904.37 911.55 985.37 1013.30 1031.08 1120.94 1132.95 1152.37 1166.59 1220.25 1259.50 1290.20 1338.67 1355.00 1373.99 1382.20 1419.08 1443.64 1467.78 1482.57 1489.73 1493.70 1502.09 1508.25 1537.28 1608.18 1688.69 1785.12 1796.60 1824.01 3114.33 3118.12 3132.72 3170.17 3180.32 3230.03 3293.63 3365.33 3558.91 3609.55 3640.30 3791.10
formula: C6H12N3O4
InChI: InChI=1S/C6H12N3O4/c7-1-4(10)8-2-5(11)9-3-6(12)13/h8-9,12H,1-3H2,7H3
25 atoms
N  -1.42971 -0.224902 -2.664329
H  -2.161522 -0.151898 -3.354621
C  -0.076174 0.013261 -3.111974
C  0.733686 -1.252338 -3.346735
H  -0.133225 0.53017 -4.071803
H  0.48453 0.654423 -2.436676
O  1.839126 -1.450797 -2.878804
C  -1.859163 -0.858197 -1.524794
C  -0.863276 -1.145926 -0.390817
O  -3.009057 -1.198707 -1.389338
N  0.024383 -0.036219 -0.083222
H  -1.47614 -1.410133 0.469884
H  -0.282236 -2.026184 -0.665063
H  -0.396334 0.879823 -0.003226
C  1.362967 -0.016243 -0.03836
C  2.146839 -1.332683 0.028657
O  2.02463 1.01108 -0.017553
H  1.691669 -2.184515 -0.461603
H  2.339903 -1.56437 1.076315
O  0.110014 -2.123602 -4.120746
H  0.672679 -2.89793 -4.263844
N  3.435946 -1.021956 -0.650101
H  4.206429 -1.618758 -0.359061
H  3.277529 -1.102864 -1.664055
H  3.626538 -0.029228 -0.430949
totalener: -701.28620157 hartree
nucrepener: 879.18759746 hartree
electener: -1580.47379903 hartree
oneelecener: -2685.77647693 hartree
twoeener: 1105.30267791 hartree
kineticenergy: 697.94681850 hartree
exchangeener: -60.043441206791 hartree
correlationener: -4.266146475008 hartree
xcener: -64.309587681799 hartree
temp: 298.15 k
press: 1.00 atm
thermalcorrenthalpy: 0.00094421 hartree
totalenthalpy: -701.10964547 hartree
totalentropycorr: -0.05054554 hartree
gibbsenthalpy: -701.16019101 hartree
gibbsminuselec: 0.17085486 hartree
totalenthalpy: -701.11088816 hartree
chargesum: 1.0000000
charge: -0.203091 0.205983 -0.105465 0.348397 0.159271 0.129114 -0.413732 0.188672 -0.118411 -0.277119 -0.183208 0.177760 0.108908 0.216877 0.232809 -0.167518 -0.347339 0.163293 0.177236 -0.214239 0.243911 -0.044339 0.234900 0.252197 0.235134
charge: 0.315991 -0.004053 -0.048462 -0.416804 0.050329 0.028286 0.087372 -0.392893 -0.027220 0.133964 0.347015 0.042499 0.025294 0.009480 -0.404521 0.031888 0.103167 0.019124 0.042969 0.413544 -0.068255 0.610462 0.045510 0.020045 0.035267
qa: -0.2031 0.2060 -0.1055 0.3484 0.1593 0.1291 -0.4137 0.1887 -0.1184 -0.2771 -0.1832 0.1778 0.1089 0.2169 0.2328 -0.1675 -0.3473 0.1633 0.1772 -0.2142 0.2439 -0.0443 0.2349 0.2522 0.2351
va: 3.0678 1.0069 3.9093 4.1451 0.9943 1.0065 2.0369 4.3368 3.7595 2.2407 3.1660 1.0057 1.0052 0.9922 4.2709 3.8629 2.1614 1.0050 0.9958 2.2965 1.0137 3.5917 0.9702 1.0063 1.0163
dispcorr: -0.045503746 hartree
energy: -701.334905155121
dipole: 6.78170 -3.26639 3.51531 -1.70783 0.66738 -1.04045 2.51542 -2.18531 0.33011
magnitude: 3.68088 au
magnitude: 9.35606 debye
zeropoint: 0.20968144 hartree
thermalvibcorrection: 0.01055662 hartree
thermalrotcorrection: 0.00141627 hartree
thermaltrasncorrection: 0.00141627 hartree
thermaltotal: -701.11183455 hartree
thermalcorr: 0.01338916 hartree
nonthermalcorr: 0.20968144 hartree
totalcorr: 0.22307061 hartree
totalenthalpy: -701.11089034 hartree
