program: Gaussian 09
title: 000047229
version: EM64L-G09RevD.01
frameworkgroup: C1[X(C14H22N2O2)]
method: RPBEPBE
basis: SDD
operation: Freq
keyword: #p
keyword: freq=noraman
keyword: PBEPBE/SDD
title: #p freq=noraman PBEPBE/SDD
converged: NO YES NO NO
title: Mulliken charges:
elementType: O O N N C C C C C C C C C C C C C C H H H H H H H H H H H H H H H H H H H H H H
charge: -0.359615 -0.257876 -0.108162 -0.372606 0.034957 -0.466819 -0.587791 -0.766125 0.529599 -0.628664 -0.633353 -0.403473 -0.395298 -0.358949 -0.357274 0.403208 0.268578 -0.602746 0.186992 0.215697 0.236162 0.219854 0.238855 0.233736 0.223255 0.213295 0.243761 0.185891 0.216024 0.216505 0.192265 0.233755 0.233078 0.230652 0.241229 0.240853 0.331382 0.228931 0.228753 0.271483
chargesum: 0.00000
title: Mulliken charges with hydrogens summed into heavy atoms:
elementType: O O N N C C C C C C C C C C C C C C
charge: -0.359615 -0.257876 -0.108162 -0.041224 0.221950 -0.014959 -0.129082 -0.095838 0.529599 0.017012 0.009172 -0.170396 -0.164646 -0.117720 -0.116420 0.403208 0.268578 0.126421
polarizability: 2.52516156e+02 -2.80328933e+00 1.53221486e+02 5.10302903e-01 8.38806878e+00 1.23370186e+02
1716.lowfreq: -40.3127 -25.7879 -0.6020 -0.0007 0.0000 0.0007 5.8388 16.4091 25.4120
frequency: -40.2774 6.0299 24.0813 27.7442 46.4972 59.6049 96.0268 97.8566 99.2631 147.0835 152.6460 194.0257 209.1865 218.4669 244.9968 248.4551 296.2999 307.6682 345.2680 355.3190 379.8917 400.6114 409.9183 416.1159 443.1807 462.5006 500.7088 543.3080 584.4631 619.6521 634.1937 648.9404 687.3879 710.6440 731.6052 775.7759 783.3504 815.3539 830.7898 846.1225 879.7304 889.1967 946.6571 958.4862 963.8422 965.9637 989.5133 1008.2524 1033.0106 1056.4968 1072.2232 1075.6200 1083.3190 1113.7467 1124.2510 1126.8406 1134.6572 1144.7959 1157.7434 1165.7897 1177.4203 1211.3587 1217.0926 1221.1099 1249.3364 1262.8639 1277.3678 1297.4350 1315.9642 1335.4758 1348.5794 1378.9688 1380.4151 1405.7326 1415.3975 1430.3887 1444.0159 1457.8708 1458.1719 1467.3644 1472.7891 1477.4269 1483.3987 1483.4363 1487.1197 1493.7593 1496.3026 1503.8653 1516.4948 1594.7631 1615.1324 1704.3115 2799.1544 2844.9363 2860.9155 2978.6032 2985.0810 2990.4799 2995.7394 3028.7443 3032.8251 3034.4088 3055.7615 3059.2602 3080.0393 3084.0889 3085.8972 3095.1357 3111.9805 3121.6131 3124.9877 3159.3187 3163.4247 3576.3307
redmass: 4.7797 3.3201 4.5180 3.8317 4.3224 2.8189 3.1914 3.9241 1.1563 3.5247 3.1975 4.0204 1.1811 1.1333 1.3325 3.7136 2.7299 2.8544 2.7181 2.3091 5.1687 2.8842 2.7248 2.8017 2.3449 2.3518 3.6089 3.3181 1.1083 3.8674 6.8715 4.4391 12.1995 3.1306 2.9289 3.2426 1.4258 2.6920 1.2572 2.4696 3.7872 2.9060 1.6046 1.5962 1.5132 1.4978 2.0526 2.8312 1.5076 1.6584 5.0510 1.7820 1.3041 1.3587 1.6928 1.2812 1.7346 1.7672 1.9946 1.4409 1.3717 1.9104 2.3651 2.9446 2.0452 1.6906 1.3240 1.2749 1.6149 1.4048 1.3554 2.9294 1.5837 3.0562 1.1392 1.1588 1.1735 1.0812 1.3356 1.0505 1.0547 1.0578 1.0509 1.0796 1.0529 1.8839 1.1411 1.0659 1.5053 7.4367 6.5366 9.5832 1.0807 1.0576 1.0577 1.0354 1.0412 1.0547 1.0614 1.0765 1.0809 1.0849 1.1027 1.1034 1.0994 1.0996 1.1000 1.0985 1.0981 1.0893 1.0891 1.0953 1.0962 1.0772
irintensity: 0.9915 0.8289 1.1083 1.9455 5.0304 0.9649 0.5493 1.9190 0.4342 0.6135 1.7890 0.5441 0.2805 0.2176 0.2810 6.5279 7.8916 1.0077 12.6320 7.5905 0.5922 1.1550 0.0830 0.9780 0.7645 3.0959 17.2510 12.4314 129.9559 6.0427 0.3641 2.5233 22.3464 0.5382 3.3651 0.5056 2.0280 10.3696 0.2749 43.8677 51.8169 40.1387 6.5178 4.3216 2.3884 1.3353 15.0645 27.4660 17.6818 25.3861 225.1085 8.8854 5.9918 8.0911 4.1168 0.0247 8.8511 171.1682 249.1343 12.7899 152.3732 17.0220 7.3420 6.3545 12.3718 33.4767 3.6104 0.6948 8.8518 16.5884 10.6246 7.5198 16.6483 1.8986 2.8328 29.6311 13.6662 32.9629 195.2166 10.0007 31.5307 4.8199 16.9239 1.3879 19.9121 145.3468 7.0619 3.5060 84.3609 1.9225 2.5572 287.7365 79.8676 81.0228 219.5554 90.5596 14.2286 11.9850 45.5944 19.8488 32.5773 33.4309 37.3777 36.9549 26.5987 57.5550 52.7215 27.5700 4.2545 15.9839 22.5124 13.9194 3.4127 41.3979
temp: 298.150 k
press: 1.00000 atm
elementType: 8 8 7 7 6 6 6 6 6 6 6 6 6 6 6 6 6 6 1 1 1 1 1 1 1 1 1 1 1 1 1 1 1 1 1 1 1 1 1 1
symmnumber: 1
zpe: 889070.8 jmol-1
zpe.correction: 0.338629 hartree
zpe.thermalcorrener: 0.357905 hartree
zpe.thermalcorrenthalpy: 0.358849 hartree
zpe.thermalcorrgfe: 0.287366 hartree
zpe.sumelectzpe: -805.235174 hartree
zpe.sumelectthermal: -805.215898 hartree
zpe.sumelectthermalent: -805.214954 hartree
zpe.sumelectthermalfe: -805.286438 hartree
dipole: 0.5668 -0.0066 -0.6628
dipole: 0.8721
quadrupole: -73.2453 -102.8178 -115.9221
quadrupole: 1.1119 -7.2941 4.0966
quadrupole: 24.0831 -5.4894 -18.5937 1.1119 -7.2941 4.0966
hfenergy: -805.5738031 hartree
pointgroup: C01 [X(C14H22N2O2)]
dipole: 0.225341 0.0237685 -0.2576679 debye
polarizability: 252.4652009|-3.5373901|151.1524464|1.350892|11.317937|125.4901807 unknown
InChI: InChI=1S/C14H22N2O2/c1-11(16(3)4)5-6-12-7-9-13(10-8-12)18-14(17)15-2/h7-11,15H,5-6H2,1-4H3
charge 0 multiplicity 1
40 atoms
O  3.66121 0.257223 -0.7157
O  3.833514 -0.745207 1.437958
N  -4.778177 -0.715651 -0.161315
N  5.705416 -0.315872 0.073558
C  -4.19382 0.103583 0.947234
C  -2.642707 0.148065 0.861051
C  -2.098055 0.715538 -0.480584
C  -4.778173 1.535539 0.959512
C  -0.584098 0.607564 -0.562154
C  -6.258234 -0.701739 -0.183443
C  -4.277198 -2.108915 -0.165766
C  0.251328 1.655559 -0.095283
C  0.032955 -0.568491 -1.063827
C  1.658162 1.536959 -0.118414
C  1.437708 -0.703672 -1.093534
C  2.236024 0.353756 -0.616691
C  4.367225 -0.319582 0.38939
C  6.722743 -0.839862 0.987226
H  -4.444841 -0.374189 1.934627
H  -2.271928 0.76661 1.702011
H  -2.21778 -0.86026 1.023289
H  -2.409075 1.772491 -0.580331
H  -2.581339 0.16253 -1.307422
H  -4.72538 1.990325 -0.045933
H  -5.829879 1.555993 1.293174
H  -4.19918 2.16681 1.657703
H  -6.635921 0.318051 -0.360086
H  -6.720066 -1.086432 0.762351
H  -6.612444 -1.335813 -1.015757
H  -4.772141 -2.670631 -0.977775
H  -4.469885 -2.650166 0.79602
H  -3.191549 -2.135928 -0.357918
H  -0.20465 2.575948 0.289451
H  -0.594277 -1.385622 -1.440974
H  2.30365 2.345372 0.239605
H  1.914368 -1.609326 -1.482099
H  5.969976 0.070251 -0.832887
H  7.442848 -0.053744 1.281135
H  7.277095 -1.681337 0.531721
H  6.210975 -1.20433 1.891978
