program: Gaussian 09
title: 000048382
version: EM64L-G09RevD.01
frameworkgroup: C1[X(C18H34N2)]
method: RPBEPBE
basis: SDD
operation: Freq
keyword: #pfreq=noraman
keyword: PBEPBE/SDD
title: #p freq=noraman PBEPBE/SDD
converged: YES YES NO NO
title: Mulliken charges:
elementType: N N C C C C C C C C C C C C C C C C C C H H H H H H H H H H H H H H H H H H H H H H H H H H H H H H H H H H
charge: -0.317424 -0.317538 0.520832 0.520878 -0.098075 -0.097949 -0.691525 -0.543295 -0.557691 -0.557776 -0.543281 -0.448629 -0.551982 -0.552183 -0.050555 -0.050568 -0.729626 -0.729602 -0.630692 -0.630683 0.186387 0.186411 0.220368 0.220386 0.192835 0.194432 0.176711 0.250987 0.176630 0.251376 0.192837 0.194421 0.188533 0.188539 0.194212 0.192689 0.194139 0.192821 0.212716 0.212669 0.204315 0.214537 0.217873 0.217878 0.204310 0.214548 0.248290 0.248382 0.191295 0.220316 0.221950 0.221939 0.191320 0.220311
chargesum: 0.00000
title: Mulliken charges with hydrogens summed into heavy atoms:
elementType: N N C C C C C C C C C C C C C C C C C C
charge: -0.069135 -0.069156 0.520832 0.520878 0.088313 0.088463 -0.250770 -0.156028 -0.129993 -0.129769 -0.156023 -0.071557 -0.165080 -0.165224 0.162161 0.162101 -0.092901 -0.092867 0.002869 0.002886
polarizability: 2.07896901e+02 -4.83079482e-03 2.02414559e+02 1.92307989e-02 6.84444900e-03 1.87036755e+02
1716.lowfreq: -0.0007 0.0001 0.0004 13.1973 20.4652 20.9863 24.7441 31.6125 70.4060
frequency: 23.8731 31.1666 70.3918 79.4864 86.0857 100.4804 110.6484 141.6022 194.9951 199.6905 210.7951 213.5853 225.6296 233.5229 243.8162 255.8275 268.9885 276.7260 284.3873 287.3232 334.9422 356.1784 392.5242 400.6163 405.6775 418.8878 428.1709 437.4595 447.3801 456.3754 509.6092 513.0712 598.8376 604.9771 624.7264 625.9669 653.8550 698.1861 759.5283 792.2655 797.0235 808.0435 843.9119 861.6557 873.0802 879.0987 882.2646 885.4708 889.9535 908.8591 936.4675 952.0352 965.0610 969.1665 971.4234 984.3692 1007.7809 1017.4262 1036.0112 1045.7276 1048.7362 1052.9735 1055.6583 1075.3005 1087.0951 1091.4759 1103.6155 1106.1641 1107.7844 1110.8583 1125.1153 1125.8660 1129.6167 1152.8989 1165.4824 1167.7026 1172.7480 1180.8827 1228.7801 1234.6635 1237.6706 1260.1565 1269.8759 1283.4433 1286.8733 1296.0599 1297.0753 1306.2075 1308.9978 1313.7368 1318.7769 1327.0247 1332.5224 1337.6099 1343.1736 1343.7291 1346.7550 1350.9031 1356.6108 1364.0136 1374.1315 1374.5907 1428.0708 1428.1822 1437.2609 1437.3294 1448.5870 1449.0919 1452.2240 1458.5186 1462.6297 1463.0521 1464.3303 1465.8599 1473.3346 1473.5277 1480.3545 1482.6539 1482.7468 1490.8448 1497.3223 1497.3596 2882.1237 2882.5857 2930.6336 2931.2099 2944.7189 2944.9550 2948.6463 2952.0872 2953.4859 2956.0077 2965.2381 2965.3549 2972.9998 2974.1737 2979.9973 2990.0034 2994.6878 2995.2611 3002.9566 3004.8564 3006.9699 3007.0486 3014.3517 3016.8169 3039.1352 3039.4941 3061.5046 3061.6296 3065.8006 3065.9104 3068.8170 3068.8796 3437.0117 3437.0726
redmass: 3.6362 3.1130 2.6916 3.0124 2.3925 2.6214 2.1939 2.3654 2.3959 2.4273 1.3123 1.2931 1.2060 1.2838 2.2823 2.1078 2.5235 3.0436 2.0385 2.1750 2.2072 2.3837 1.9901 4.5316 4.5213 1.9299 2.0778 1.7683 1.7739 1.8945 2.5205 2.4333 2.9189 2.4758 1.7279 1.9504 3.7530 4.1747 2.8636 3.0677 2.2566 1.9819 2.0398 1.7053 1.7026 1.8262 1.5933 2.0450 1.5752 1.9553 2.2662 2.1059 1.9423 1.9831 2.1265 2.1193 1.8113 1.7516 2.0130 1.6670 1.9342 2.1070 1.6930 1.8954 1.9286 1.7794 1.2954 1.0947 1.5171 1.3365 1.8409 1.9408 1.2337 1.6946 2.5538 1.9771 1.7287 1.5778 2.5006 1.6491 1.6134 1.5349 1.5321 1.6993 1.8237 1.6854 1.5794 1.9891 1.3257 1.4984 1.3788 1.8064 1.4089 1.3347 1.3447 1.4631 1.4394 1.4559 1.5324 1.5536 1.2181 1.2301 1.1295 1.1300 1.1321 1.1305 1.1127 1.1109 1.0793 1.0859 1.0674 1.0643 1.0909 1.0810 1.0928 1.0945 1.0834 1.0582 1.0563 1.0873 1.0411 1.0411 1.0544 1.0544 1.0618 1.0615 1.0616 1.0596 1.0626 1.0635 1.0633 1.0607 1.0372 1.0374 1.0820 1.0813 1.0844 1.0828 1.0974 1.0973 1.1018 1.1006 1.0760 1.0760 1.1019 1.1017 1.0961 1.0962 1.0992 1.0992 1.0995 1.0995 1.0990 1.0990 1.0742 1.0742
irintensity: 0.0988 0.3820 0.1535 0.8488 0.6501 0.4002 1.0770 0.0174 1.0423 0.7859 0.4666 1.1135 0.3747 0.1936 0.0376 1.0113 2.7878 3.6410 0.0011 0.1551 0.3481 0.0988 0.4277 0.1171 0.0001 1.4393 2.3374 0.0370 4.4067 1.5778 12.2157 10.0383 21.5051 27.0439 159.0516 54.5001 2.4186 3.2195 3.6664 9.9465 0.3328 5.0362 5.2435 7.3547 7.6463 0.0334 0.7056 0.0487 0.1429 0.2944 11.0521 0.1592 0.2118 1.1202 10.4690 14.4871 11.4272 3.1427 2.9874 0.2862 18.7637 9.6776 8.7527 0.9028 0.6601 5.5106 6.4603 1.4771 4.4489 0.1879 2.1194 17.7301 1.1787 3.1641 61.7303 6.1773 9.2227 0.3341 15.9594 0.0182 0.0038 0.3488 1.8091 1.6653 0.2599 5.0246 1.6502 7.5612 0.3362 2.2463 0.9924 16.6224 0.3444 0.0604 7.0658 11.7666 0.0014 9.5502 4.6094 1.1811 32.8035 5.4676 5.4564 0.5382 26.8263 5.9193 4.7404 9.6883 1.4824 4.9283 5.3000 15.4362 12.0530 4.1212 7.5372 1.1402 20.8667 5.9278 9.1426 0.2591 17.5951 5.5747 154.1657 171.1442 36.6879 1.2136 32.7289 0.6468 33.2089 146.9633 1.3214 38.6222 55.3473 22.7670 55.5501 1.2795 127.9779 123.3893 32.9282 8.0721 29.2632 63.4984 2.8820 83.4337 41.2590 78.0208 10.9601 34.2873 46.1719 34.4231 109.7996 4.3147 16.7763 57.2758 1.0746 0.9070
temp: 298.150 k
press: 1.00000 atm
elementType: 7 7 6 6 6 6 6 6 6 6 6 6 6 6 6 6 6 6 6 6 1 1 1 1 1 1 1 1 1 1 1 1 1 1 1 1 1 1 1 1 1 1 1 1 1 1 1 1 1 1 1 1 1 1
symmnumber: 1
zpe: 1291381.6 jmol-1
zpe.correction: 0.491861 hartree
zpe.thermalcorrener: 0.513214 hartree
zpe.thermalcorrenthalpy: 0.514158 hartree
zpe.thermalcorrgfe: 0.442828 hartree
zpe.sumelectzpe: -814.176241 hartree
zpe.sumelectthermal: -814.154888 hartree
zpe.sumelectthermalent: -814.153944 hartree
zpe.sumelectthermalfe: -814.225274 hartree
dipole: 0.0018 -1.1904 0.0024
dipole: 1.1904
quadrupole: -115.8860 -125.9155 -127.6424
quadrupole: -0.0027 1.3218 0.0008
quadrupole: 7.2620 -2.7676 -4.4944 -0.0027 1.3218 0.0008
hfenergy: -814.6681019 hartree
pointgroup: C01 [X(C18H34N2)]
dipole: -0.0010085 0.4683335 0.00082 debye
polarizability: 207.8679106|-0.001148|202.4145528|0.7773986|-0.0094474|187.0657518 unknown
InChI: InChI=1S/C18H34N2/c1-13(19-3)6-17-8-15-5-16(9-17)11-18(10-15,12-17)7-14(2)20-4/h13-16,19-20H,5-12H2,1-4H3
charge 0 multiplicity 1
54 atoms
N  3.416372 1.172605 -0.694058
N  -3.413621 1.170793 0.693546
C  1.134692 -0.645019 0.610977
C  -1.134274 -0.644617 -0.612274
C  -0.606949 -2.460693 1.107696
C  0.605202 -2.46298 -1.106424
C  0.000653 0.22898 -0.001191
C  0.503724 -1.560338 1.706343
C  1.718261 -1.564035 -0.50487
C  -1.718945 -1.56132 0.504841
C  -0.504319 -1.562112 -1.706422
C  -0.001457 -3.363035 0.001251
C  2.230324 0.227027 1.297078
C  -2.229269 0.227604 -1.299094
C  2.743461 1.50707 0.587143
C  -2.743076 1.506893 -0.588465
C  3.633364 2.322418 1.571779
C  -3.635465 2.321231 -1.571728
C  3.817092 2.30503 -1.548099
C  -3.814588 2.302095 1.548954
H  -1.040736 -3.091941 1.909659
H  1.03825 -3.095885 -1.90748
H  -0.423433 0.882303 0.788307
H  0.425411 0.880878 -0.791505
H  0.076861 -0.930816 2.514493
H  1.29683 -2.18755 2.16575
H  2.522939 -2.198398 -0.075564
H  2.175522 -0.930697 -1.287191
H  -2.524336 -2.195344 0.076391
H  -2.175548 -0.926351 1.286266
H  -0.076622 -0.93416 -2.515354
H  -1.298127 -2.188989 -2.165082
H  0.782475 -4.020866 0.429028
H  -0.786215 -4.020484 -0.425607
H  3.105354 -0.422159 1.525851
H  1.833284 0.555086 2.281098
H  -3.104152 -0.421609 -1.528323
H  -1.831869 0.556027 -2.282848
H  1.870557 2.139311 0.324231
H  -1.870661 2.140178 -0.326465
H  4.487045 1.710665 1.924048
H  3.053778 2.637767 2.459938
H  4.037533 3.234341 1.09512
H  -4.040327 3.232454 -1.094318
H  -4.488729 1.708342 -1.923036
H  -3.057515 2.637652 -2.460572
H  4.180406 0.497912 -0.549866
H  -4.176861 0.495027 0.550161
H  4.570741 2.999889 -1.105139
H  2.922155 2.905623 -1.798517
H  4.232717 1.919896 -2.497008
H  -4.228151 1.915748 2.498269
H  -4.569941 2.996145 1.107637
H  -2.920116 2.903806 1.798347
