program: AMS
programVersion: 2021.106
runtype: GEOMETRY OPTIMIZATION
method: DFT
functional: PBEc PBEx
spinMolecule: Restricted
epsl: 78.39000
solvent: Water angstrom
functional: PW92 == Not Default ==
formula: O62P2W18
InChI: InChI=1S/2O4P.54O.18W/c2*1-5(2,3)4;;;;;;;;;;;;;;;;;;;;;;;;;;;;;;;;;;;;;;;;;;;;;;;;;;;;;;;;;;;;;;;;;;;;;;;;
82 atoms
P  0.000000 0.000000 -2.000237
O  1.486384 -0.000000 -1.541145
W  3.134952 -1.707863 -1.898573
O  4.459941 -2.773648 -2.227439
O  1.696212 -2.937926 -1.572064
W  -0.088423 -3.568879 -1.898573
O  0.172079 -5.249247 -2.227439
O  -0.743192 -1.287246 -1.541145
W  -3.046529 -1.861017 -1.898573
O  -4.632020 -2.475598 -2.227439
O  -3.392424 0.000000 -1.572064
W  -3.046529 1.861017 -1.898573
O  -4.632020 2.475598 -2.227439
O  -2.624846 -1.306711 -3.716544
W  -1.980905 -0.000000 -4.966524
O  -3.225829 -0.000000 -6.172209
O  -3.029738 -2.141405 0.000000
W  -3.046529 -1.861017 1.898573
O  -4.632020 -2.475598 2.227439
O  -2.003464 -3.470102 -2.153966
O  0.180778 -2.926538 -3.716544
W  0.990452 -1.715514 -4.966524
O  1.612915 -2.793650 -6.172209
O  0.000000 0.000000 -3.603554
W  0.990452 1.715514 -4.966524
O  1.612915 2.793650 -6.172209
O  2.444068 -1.619828 -3.716544
O  1.548675 -0.000000 -5.697960
O  -0.774337 -1.341192 -5.697960
O  -0.339642 -3.694532 0.000000
W  -0.088423 -3.568879 1.898573
O  0.172079 -5.249247 2.227439
O  -2.624846 1.306711 -3.716544
O  -0.774337 1.341192 -5.697960
O  -0.743192 1.287246 -1.541145
W  -0.088423 3.568879 -1.898573
O  0.172079 5.249247 -2.227439
O  0.180778 2.926538 -3.716544
O  1.696212 2.937926 -1.572064
W  3.134952 1.707863 -1.898573
O  4.459941 2.773648 -2.227439
O  2.444068 1.619828 -3.716544
O  4.006929 -0.000000 -2.153966
O  3.369380 1.553127 0.000000
W  3.134952 1.707863 1.898573
O  4.459941 2.773648 2.227439
O  -2.003464 3.470102 -2.153966
O  -0.339642 3.694532 0.000000
W  -0.088423 3.568879 1.898573
O  0.172079 5.249247 2.227439
O  -3.029738 2.141405 0.000000
W  -3.046529 1.861017 1.898573
O  -4.632020 2.475598 2.227439
O  3.369380 -1.553127 0.000000
W  3.134952 -1.707863 1.898573
O  4.459941 -2.773648 2.227439
O  1.486384 -0.000000 1.541145
O  0.000000 0.000000 3.603554
W  0.990452 1.715514 4.966524
O  1.612915 2.793650 6.172209
O  -0.743192 1.287246 1.541145
O  -0.743192 -1.287246 1.541145
O  2.444068 1.619828 3.716544
O  1.696212 2.937926 1.572064
O  4.006929 -0.000000 2.153966
O  -3.392424 0.000000 1.572064
O  -2.624846 -1.306711 3.716544
W  -1.980905 -0.000000 4.966524
O  -3.225829 -0.000000 6.172209
O  -2.003464 -3.470102 2.153966
O  1.696212 -2.937926 1.572064
O  0.180778 -2.926538 3.716544
W  0.990452 -1.715514 4.966524
O  1.612915 -2.793650 6.172209
O  2.444068 -1.619828 3.716544
O  1.548675 -0.000000 5.697960
O  -0.774337 -1.341192 5.697960
O  -2.624846 1.306711 3.716544
O  -0.774337 1.341192 5.697960
O  0.180778 2.926538 3.716544
O  -2.003464 3.470102 2.153966
P  0.000000 0.000000 2.000237
elementType: P O W O O W O O W O O W O O W O O W O O O W O O W O O O O O W O O O O W O O O W O O O O W O O O W O O W O O W O O O W O O O O O O O O W O O O O W O O O O O O O O P
mdcq: 1.556318 -0.792973 2.053664 -0.664416 -0.757527 2.054388 -0.665869 -0.783105 2.054863 -0.663853 -0.764934 2.054863 -0.663853 -0.771638 2.034206 -0.659563 -0.731684 2.054863 -0.663853 -0.779402 -0.772258 2.039152 -0.660804 -0.823710 2.039152 -0.660804 -0.773035 -0.799367 -0.797962 -0.731356 2.054388 -0.665869 -0.771638 -0.797962 -0.783105 2.054388 -0.665869 -0.772258 -0.757527 2.053664 -0.664416 -0.773035 -0.778952 -0.732386 2.053664 -0.664416 -0.779402 -0.731356 2.054388 -0.665869 -0.731684 2.054863 -0.663853 -0.732386 2.053664 -0.664416 -0.792973 -0.823710 2.039152 -0.660804 -0.783105 -0.783105 -0.773035 -0.757527 -0.778952 -0.764934 -0.771638 2.034206 -0.659563 -0.779402 -0.757527 -0.772258 2.039152 -0.660804 -0.773035 -0.799367 -0.797962 -0.771638 -0.797962 -0.772258 -0.779402 1.556318
eener: -23.994140 electronvolt
kinener: 23.218813 electronvolt
coulombener: -1.447424 electronvolt
xcener: -22.966827 electronvolt
solvener: -1.310136 electronvolt
dispener: 0.000000 electronvolt
total: -26.499713 electronvolt
charge: 2.315887 -0.988609 2.572783 -0.771985 -0.958441 2.572783 -0.771985 -0.988609 2.572783 -0.771985 -0.958441 2.572783 -0.771985 -0.954600 2.536548 -0.778714 -0.958962 2.572783 -0.771985 -0.986982 -0.954600 2.536548 -0.778714 -1.084620 2.536548 -0.778714 -0.954600 -0.967659 -0.967659 -0.958962 2.572783 -0.771985 -0.954600 -0.967659 -0.988609 2.572783 -0.771985 -0.954600 -0.958441 2.572783 -0.771985 -0.954600 -0.986982 -0.958962 2.572783 -0.771985 -0.986982 -0.958962 2.572783 -0.771985 -0.958962 2.572783 -0.771985 -0.958962 2.572783 -0.771985 -0.988609 -1.084620 2.536548 -0.778714 -0.988609 -0.988609 -0.954600 -0.958441 -0.986982 -0.958441 -0.954600 2.536548 -0.778714 -0.986982 -0.958441 -0.954600 2.536548 -0.778714 -0.954600 -0.967659 -0.967659 -0.954600 -0.967659 -0.954600 -0.986982 2.315887
quadrupole: 75.771329 0.000000 0.000000 75.771362 -0.000000 -151.542691
charge: -6
converged: GEOMETRY CONVERGED
mo.energy: -24.537 electronvolt
energy: -24.020 -24.020 -24.020 -24.020 -5.506 -24.020 10.422 electronvolt
mo.energy: -24.512 electronvolt
energy: -24.020 -24.020 -24.020 -24.020 -5.506 -24.020 10.422 -5.688 electronvolt
mo.energy: -24.421 electronvolt
energy: -24.020 -24.020 -24.020 -24.020 -5.506 -24.020 -24.020 -24.020 -24.020 -5.688 2.188 electronvolt
mo.energy: -24.404 electronvolt
energy: -24.020 -24.020 -24.020 -24.020 -24.020 -24.020 -4.498 -24.020 -5.688 electronvolt
mo.energy: -24.291 electronvolt
energy: -24.020 -24.020 -24.020 -5.506 -24.020 -24.020 -24.020 10.422 -5.688 electronvolt
mo.energy: -24.241 electronvolt
energy: -24.020 -24.020 -24.020 -24.020 -24.020 -4.498 -24.020 electronvolt
mo.energy: -24.064 electronvolt
energy: -24.020 -24.020 -24.020 -24.020 -24.020 -24.020 -24.020 -4.498 -5.506 electronvolt
mo.energy: -23.920 electronvolt
energy: -24.020 -24.020 -24.020 -24.020 -24.020 -24.020 -4.498 -24.020 -4.498 -4.498 -5.506 electronvolt
mo.energy: -23.885 electronvolt
energy: -24.020 -24.020 -24.020 -24.020 -24.020 -24.020 -4.498 2.188 -4.498 -4.498 electronvolt
mo.energy: -23.881 electronvolt
energy: -24.020 -24.020 -24.020 -24.020 -24.020 -24.020 -4.498 -4.498 -5.506 -4.498 -4.498 electronvolt
mo.energy: -23.875 electronvolt
energy: -24.020 -24.020 -24.020 -24.020 -24.020 -24.020 -4.498 2.188 electronvolt
mo.energy: -23.795 electronvolt
energy: -24.020 -24.020 -4.498 4.055 -24.020 -4.498 electronvolt
mo.energy: -23.730 electronvolt
energy: -24.020 -24.020 -24.020 -24.020 -24.020 -24.020 -4.498 -4.498 -4.498 -4.498 electronvolt
mo.energy: -23.677 electronvolt
energy: -24.020 -24.020 -24.020 -24.020 -24.020 -24.020 -4.498 -4.498 -24.020 4.055 electronvolt
mo.energy: -23.484 electronvolt
energy: -24.020 -24.020 -4.498 -24.020 -24.020 -24.020 -24.020 -5.688 electronvolt
mo.energy: -23.430 electronvolt
energy: -24.020 -24.020 -24.020 -24.020 -24.020 -4.498 -4.498 -4.498 electronvolt
mo.energy: -23.402 electronvolt
energy: -24.020 -24.020 -24.020 -24.020 -24.020 -4.498 -24.020 -4.498 -24.020 -24.020 electronvolt
mo.energy: -23.317 electronvolt
energy: -24.020 -4.498 -24.020 -4.498 -4.498 electronvolt
mo.energy: -23.251 electronvolt
energy: -24.020 -24.020 -24.020 -24.020 -24.020 electronvolt
mo.energy: -23.221 electronvolt
energy: -24.020 -24.020 -24.020 -24.020 -24.020 -4.498 electronvolt
mo.energy: -23.058 electronvolt
energy: -24.020 -24.020 -24.020 -4.498 electronvolt
mo.energy: -23.038 electronvolt
energy: -24.020 -24.020 -24.020 -24.020 -24.020 -24.020 -4.498 electronvolt
mo.energy: -22.949 electronvolt
energy: -24.020 -24.020 -24.020 -24.020 -24.020 -24.020 -24.020 electronvolt
mo.energy: -22.931 electronvolt
mo.energy: -22.889 electronvolt
energy: -24.020 -24.020 -24.020 -4.498 -4.498 electronvolt
mo.energy: -22.878 electronvolt
energy: -24.020 -24.020 -24.020 -4.498 -24.020 -43.195 electronvolt
mo.energy: -22.877 electronvolt
energy: -24.020 -4.498 -24.020 -4.498 1.231 -5.688 electronvolt
mo.energy: -22.866 electronvolt
energy: -24.020 -4.498 -24.020 -43.195 -4.498 -24.020 -0.500 electronvolt
mo.energy: -22.862 electronvolt
energy: -24.020 -24.020 -4.498 -24.020 -24.020 -4.498 electronvolt
mo.energy: -22.861 electronvolt
energy: -24.020 -4.498 -24.020 -24.020 -24.020 -4.498 -24.020 -43.195 electronvolt
mo.energy: -22.859 electronvolt
energy: -24.020 -24.020 -24.020 -4.498 -4.498 -4.498 electronvolt
mo.energy: -22.858 electronvolt
energy: -24.020 -24.020 -24.020 -24.020 -4.498 -24.020 -4.498 -43.195 electronvolt
mo.energy: -22.856 electronvolt
energy: -24.020 -4.498 -24.020 -24.020 -4.498 electronvolt
mo.energy: -22.844 electronvolt
energy: -24.020 -4.498 -24.020 -24.020 -24.020 -4.498 -24.020 -24.020 electronvolt
mo.energy: -22.835 electronvolt
mo.energy: -22.833 electronvolt
energy: -24.020 -4.498 -24.020 -4.498 -24.020 -0.500 electronvolt
mo.energy: -22.832 electronvolt
energy: -24.020 -4.498 -24.020 -24.020 -43.195 -4.498 electronvolt
mo.energy: -22.813 electronvolt
energy: -24.020 -24.020 -4.498 -24.020 -24.020 -24.020 -4.498 electronvolt
mo.energy: -22.745 electronvolt
mo.energy: -14.561 electronvolt
energy: -9.089 -9.089 -24.020 -13.975 3.091 -24.020 -9.089 -4.498 -4.498 electronvolt
mo.energy: -14.471 electronvolt
energy: -9.089 -9.089 -24.020 -13.975 3.091 -24.020 -4.498 -4.498 -9.089 9.585 electronvolt
mo.energy: -12.871 electronvolt
energy: -4.498 -9.089 -9.089 -9.089 -9.089 -4.498 -9.089 -4.498 -9.089 4.055 -4.498 -4.498 -9.089 4.055 electronvolt
mo.energy: -12.795 electronvolt
energy: -9.089 -9.089 -4.498 -9.089 -9.089 -9.089 -9.089 4.055 -4.498 -9.089 1.231 -5.688 -4.498 1.231 -4.498 -9.089 -9.089 -5.688 -4.498 -4.498 -4.498 4.055 electronvolt
mo.energy: -12.784 electronvolt
energy: -9.089 -9.089 -4.498 -4.498 4.055 -4.498 1.231 -4.498 4.055 electronvolt
mo.energy: -12.669 electronvolt
energy: -9.089 -9.089 -4.498 -9.089 -9.089 1.231 4.055 -9.089 -5.688 -4.498 -9.089 -4.498 15.256 -9.089 electronvolt
mo.energy: -12.615 electronvolt
energy: -9.089 -9.089 -5.506 -4.498 -9.089 -9.089 -9.089 -4.498 2.188 -4.498 -9.089 -9.089 -24.020 -4.498 -24.020 electronvolt
mo.energy: -12.561 electronvolt
energy: -9.089 -9.089 -4.498 -4.498 -9.089 -5.506 -9.089 2.188 -9.089 -9.089 -9.089 -4.498 -4.498 -9.089 -9.089 -9.089 -9.089 electronvolt
mo.energy: -12.469 electronvolt
energy: -9.089 -4.498 -9.089 -9.089 -9.089 4.055 -9.089 -9.089 -4.498 -4.498 -4.498 -9.089 1.231 -9.089 electronvolt
mo.energy: -12.413 electronvolt
energy: -9.089 -9.089 -4.498 -9.089 4.055 -9.089 -9.089 -9.089 -9.089 -4.498 1.231 -5.506 2.188 electronvolt
mo.energy: -12.323 electronvolt
energy: -9.089 -5.506 -9.089 -9.089 -9.089 -4.498 -4.498 -9.089 -9.089 -4.498 -9.089 -24.020 -4.498 -9.089 2.188 -4.498 -9.089 -9.089 -9.089 -0.500 -4.498 -9.089 electronvolt
mo.energy: -12.160 electronvolt
energy: -9.089 -9.089 -4.498 -9.089 -4.498 4.055 -4.498 -9.089 4.055 electronvolt
mo.energy: -12.138 electronvolt
energy: -9.089 -9.089 -5.506 -4.498 -9.089 -9.089 -9.089 -24.020 -4.498 -9.089 2.188 -9.089 -4.498 -9.089 -4.498 electronvolt
mo.energy: -12.112 electronvolt
energy: -9.089 -9.089 -9.089 -9.089 -9.089 -4.498 -9.089 -4.498 -9.089 -4.498 -4.498 -4.498 -4.498 -9.089 -4.498 -9.089 -9.089 -9.089 -4.498 1.231 -9.089 4.055 4.055 electronvolt
mo.energy: -11.947 electronvolt
energy: -9.089 -9.089 -9.089 -4.498 -9.089 -4.498 -9.089 -9.089 4.055 -9.089 -4.498 -4.498 -4.498 -24.020 -9.089 electronvolt
mo.energy: -11.859 electronvolt
energy: -9.089 -9.089 -9.089 -4.498 -9.089 -9.089 4.055 -4.498 -9.089 -9.089 -24.020 -4.498 electronvolt
mo.energy: -11.648 electronvolt
energy: -9.089 -4.498 -9.089 -9.089 -9.089 -4.498 -9.089 -4.498 -4.498 -9.089 4.055 -4.498 -4.498 -9.089 -9.089 -4.498 -9.089 4.055 electronvolt
mo.energy: -11.315 electronvolt
energy: -9.089 -9.089 -9.089 -4.498 -4.498 -9.089 -4.498 -9.089 -9.089 -9.089 -4.498 -9.089 -9.089 -9.089 -4.498 -9.089 -9.089 -9.089 -9.089 -9.089 -9.089 -9.089 -4.498 -9.089 10.422 electronvolt
mo.energy: -11.290 electronvolt
energy: -9.089 -9.089 -9.089 -9.089 -9.089 -9.089 -4.498 -4.498 -4.498 -4.498 -4.498 -9.089 -9.089 -9.089 -4.498 -4.498 -9.089 -4.498 -4.498 -9.089 -9.089 electronvolt
mo.energy: -11.284 electronvolt
energy: -9.089 -9.089 -4.498 -4.498 -9.089 -4.498 -4.498 -9.089 -9.089 -9.089 -4.498 -4.498 -9.089 4.055 4.055 -4.498 electronvolt
mo.energy: -11.259 electronvolt
energy: -9.089 -4.498 -9.089 -4.498 -9.089 -9.089 -4.498 -9.089 -9.089 -4.498 -9.089 -9.089 4.055 -9.089 electronvolt
mo.energy: -11.206 electronvolt
energy: -9.089 -4.498 -9.089 -9.089 -4.498 -9.089 -9.089 -9.089 -4.498 -9.089 -4.498 -9.089 -9.089 -4.498 -9.089 -4.498 -9.089 -4.498 -9.089 -9.089 4.055 -9.089 electronvolt
mo.energy: -11.062 electronvolt
energy: -9.089 -9.089 -9.089 -9.089 -9.089 -4.498 -4.498 -9.089 -9.089 -9.089 -4.498 -4.498 -9.089 -9.089 -9.089 -4.498 -4.498 -9.089 -9.089 -9.089 -9.089 -9.089 -9.089 electronvolt
mo.energy: -10.978 electronvolt
energy: -9.089 -9.089 -4.498 -4.498 -4.498 -24.020 4.055 -9.089 4.055 electronvolt
mo.energy: -10.875 electronvolt
energy: -9.089 -9.089 -4.498 -9.089 -9.089 -9.089 -9.089 -4.498 -9.089 -4.498 -9.089 -4.498 -4.498 -9.089 -9.089 -9.089 -4.498 -9.089 -9.089 -0.500 -9.089 -9.089 10.422 -4.498 -9.089 -9.089 -9.089 electronvolt
mo.energy: -10.863 electronvolt
energy: -9.089 -9.089 -9.089 -9.089 -9.089 -4.498 -4.498 -9.089 -4.498 -9.089 -9.089 -9.089 -9.089 -4.498 -9.089 -9.089 -9.089 -9.089 -9.089 -0.500 -4.498 -9.089 10.422 -4.498 -4.498 electronvolt
mo.energy: -10.782 electronvolt
energy: -9.089 -4.498 -9.089 -9.089 -9.089 -9.089 -9.089 -4.498 -9.089 -9.089 -4.498 -4.498 -4.498 -9.089 -9.089 -4.498 -4.498 -9.089 -9.089 -9.089 4.055 electronvolt
mo.energy: -10.736 electronvolt
energy: -9.089 -9.089 -4.498 -9.089 -9.089 -9.089 -9.089 -9.089 -4.498 -9.089 -4.498 -9.089 -4.498 4.055 -4.498 -9.089 electronvolt
mo.energy: -10.728 electronvolt
energy: -4.498 -9.089 -4.498 -9.089 -9.089 -9.089 -9.089 -9.089 -9.089 -9.089 -9.089 -9.089 -9.089 -4.498 -4.498 -9.089 4.055 -9.089 electronvolt
mo.energy: -10.711 electronvolt
energy: -4.498 -9.089 -9.089 -9.089 -9.089 -9.089 -4.498 -9.089 -9.089 -9.089 -4.498 -9.089 4.055 -4.498 -4.498 electronvolt
mo.energy: -10.526 electronvolt
energy: -4.498 -9.089 -9.089 -9.089 -9.089 -4.498 -4.498 -4.498 -9.089 -9.089 -9.089 -9.089 -9.089 -9.089 -9.089 -9.089 -4.498 -4.498 -9.089 -9.089 -4.498 electronvolt
mo.energy: -10.498 electronvolt
energy: -9.089 -9.089 -9.089 -9.089 -9.089 -4.498 -4.498 -4.498 -9.089 -4.498 -4.498 -4.498 -9.089 -9.089 -4.498 -9.089 -9.089 -9.089 -9.089 -9.089 -9.089 electronvolt
mo.energy: -10.453 electronvolt
energy: -9.089 -4.498 -9.089 -9.089 -9.089 -9.089 -9.089 -4.498 -9.089 -4.498 -9.089 -4.498 -9.089 -4.498 -9.089 -4.498 -4.498 -9.089 -9.089 -4.498 -9.089 electronvolt
mo.energy: -10.406 electronvolt
energy: -9.089 -9.089 -4.498 -4.498 -9.089 -9.089 -9.089 -4.498 -9.089 -9.089 -9.089 -9.089 -9.089 -4.498 -24.020 -4.498 4.055 electronvolt
mo.energy: -10.317 electronvolt
energy: -9.089 -4.498 -9.089 -4.498 -9.089 -9.089 -9.089 -9.089 -9.089 -4.498 -4.498 -9.089 -4.498 4.055 electronvolt
mo.energy: -10.311 electronvolt
energy: -4.498 -9.089 -9.089 -9.089 -9.089 -9.089 -9.089 -9.089 -9.089 -9.089 -4.498 -9.089 -9.089 -4.498 -4.498 -9.089 -9.089 -4.498 -9.089 -9.089 -4.498 -4.498 electronvolt
mo.energy: -10.301 electronvolt
energy: -9.089 -9.089 -4.498 -9.089 -9.089 -9.089 -4.498 -4.498 -9.089 -9.089 -4.498 -9.089 -9.089 -4.498 -9.089 -4.498 -9.089 -9.089 2.188 -9.089 electronvolt
mo.energy: -10.271 electronvolt
energy: -9.089 -4.498 -9.089 -4.498 -9.089 -9.089 -9.089 -4.498 -9.089 -9.089 -9.089 -9.089 -9.089 -9.089 -4.498 -9.089 -4.498 -9.089 -9.089 -4.498 -9.089 -9.089 -9.089 -9.089 electronvolt
mo.energy: -10.231 electronvolt
energy: -9.089 -4.498 -9.089 -4.498 -9.089 -9.089 -9.089 -9.089 -9.089 -9.089 -9.089 -4.498 -9.089 -9.089 -4.498 -4.498 -4.498 -9.089 -4.498 -4.498 -9.089 -9.089 -9.089 -9.089 -9.089 -9.089 electronvolt
mo.energy: -10.094 electronvolt
energy: -9.089 -4.498 -9.089 -9.089 -9.089 -9.089 -9.089 -9.089 -4.498 -9.089 -9.089 -4.498 -9.089 -9.089 -9.089 -9.089 electronvolt
mo.energy: -10.090 electronvolt
energy: -4.498 -9.089 -9.089 -9.089 -9.089 -9.089 -9.089 -4.498 -9.089 -5.506 -9.089 -9.089 -9.089 -9.089 -4.498 -9.089 electronvolt
mo.energy: -10.082 electronvolt
energy: -9.089 -9.089 -9.089 -4.498 -9.089 -9.089 -9.089 -9.089 -4.498 -4.498 -9.089 -9.089 -9.089 -9.089 -9.089 -4.498 -4.498 -9.089 -9.089 -9.089 electronvolt
mo.energy: -10.034 electronvolt
energy: -9.089 -9.089 -9.089 -9.089 -9.089 -4.498 -9.089 -9.089 -9.089 -4.498 -4.498 -9.089 -9.089 -4.498 -9.089 -4.498 -9.089 -9.089 -9.089 -4.498 -9.089 -9.089 -4.498 electronvolt
mo.energy: -9.984 electronvolt
energy: -9.089 -9.089 -9.089 -9.089 -4.498 -9.089 -4.498 -9.089 -4.498 -24.020 -9.089 -9.089 -4.498 4.055 4.055 -9.089 electronvolt
mo.energy: -9.908 electronvolt
energy: -9.089 -9.089 -9.089 -9.089 -9.089 -9.089 -4.498 -4.498 -4.498 -9.089 -4.498 -4.498 -4.498 -4.498 -9.089 -9.089 -9.089 -24.020 electronvolt
mo.energy: -9.881 electronvolt
energy: -9.089 -9.089 -9.089 -9.089 -9.089 -9.089 -4.498 -9.089 -9.089 -9.089 -4.498 -4.498 -4.498 -9.089 -9.089 -9.089 -9.089 -9.089 -4.498 -4.498 -9.089 -9.089 -9.089 -4.498 -4.498 -4.498 -4.498 -9.089 electronvolt
mo.energy: -9.870 electronvolt
energy: -9.089 -9.089 -9.089 -9.089 -9.089 -9.089 -9.089 -4.498 -9.089 -4.498 -9.089 -4.498 -0.500 -4.498 4.055 -9.089 electronvolt
mo.energy: -9.774 electronvolt
energy: -9.089 -9.089 -9.089 -4.498 -9.089 -9.089 -4.498 -9.089 -9.089 -9.089 -9.089 -4.498 -9.089 -9.089 -9.089 -9.089 -9.089 -4.498 -4.498 -4.498 -9.089 -9.089 -9.089 -4.498 electronvolt
mo.energy: -9.771 electronvolt
energy: -9.089 -9.089 -4.498 -9.089 -4.498 -9.089 -9.089 -9.089 -9.089 -4.498 -4.498 -0.500 -9.089 -24.020 electronvolt
mo.energy: -9.707 electronvolt
energy: -9.089 -9.089 -9.089 -4.498 -9.089 -9.089 -4.498 -4.498 -9.089 -4.498 -24.020 -9.089 -4.498 -9.089 4.055 1.231 -5.688 -9.089 electronvolt
mo.energy: -9.593 electronvolt
energy: -9.089 -9.089 -9.089 -9.089 -9.089 -9.089 -9.089 -4.498 -9.089 -9.089 -4.498 -9.089 -9.089 -9.089 -9.089 -9.089 -4.498 electronvolt
mo.energy: -9.545 electronvolt
energy: -9.089 -9.089 -9.089 -9.089 -4.498 -9.089 -9.089 -4.498 -4.498 -9.089 -24.020 -9.089 -24.020 -4.498 -4.498 -9.089 -24.020 -9.089 electronvolt
mo.energy: -9.508 electronvolt
energy: -9.089 -9.089 -9.089 -4.498 -9.089 -9.089 -9.089 -9.089 -9.089 -4.498 -9.089 -9.089 -9.089 -9.089 -4.498 -9.089 -4.498 -9.089 -4.498 -4.498 -9.089 electronvolt
mo.energy: -9.483 electronvolt
energy: -9.089 -9.089 -9.089 -9.089 -9.089 -9.089 -4.498 -4.498 -0.500 -9.089 -9.089 -4.498 -9.089 -9.089 20.662 -4.498 4.055 electronvolt
mo.energy: -9.436 electronvolt
energy: -9.089 -9.089 -9.089 -9.089 -9.089 -9.089 -9.089 -4.498 -4.498 -0.500 -9.089 4.055 -9.089 20.662 -24.020 -9.089 electronvolt
mo.energy: -9.395 electronvolt
energy: -9.089 -4.498 -9.089 -9.089 -9.089 -9.089 -9.089 -9.089 -4.498 -9.089 -4.498 -4.498 -9.089 -4.498 -9.089 electronvolt
mo.energy: -9.375 electronvolt
energy: -9.089 -4.498 -9.089 -9.089 -9.089 -9.089 -4.498 -9.089 -9.089 -4.498 -9.089 -9.089 -4.498 -9.089 -4.498 -9.089 -9.089 -4.498 -9.089 -9.089 electronvolt
mo.energy: -9.370 electronvolt
energy: -9.089 -9.089 -9.089 -4.498 -9.089 -9.089 -9.089 -9.089 -9.089 -9.089 -9.089 -9.089 -9.089 -9.089 -9.089 -9.089 -4.498 -9.089 -4.498 -4.498 electronvolt
mo.energy: -9.363 electronvolt
energy: -9.089 -9.089 -9.089 -9.089 -9.089 -4.498 -4.498 -9.089 -4.498 -9.089 -4.498 -9.089 -4.498 -9.089 -9.089 -9.089 electronvolt
mo.energy: -9.319 electronvolt
energy: -9.089 -4.498 -9.089 -9.089 -9.089 -9.089 -4.498 -4.498 -9.089 -9.089 -9.089 -9.089 -9.089 -9.089 -9.089 -4.498 -9.089 -9.089 -4.498 electronvolt
mo.energy: -9.313 electronvolt
energy: -9.089 -9.089 -9.089 -9.089 -4.498 -4.498 -9.089 -24.020 -9.089 -4.498 -4.498 -24.020 -9.089 4.055 -4.498 -9.089 -24.020 electronvolt
mo.energy: -9.267 electronvolt
energy: -9.089 -9.089 -9.089 -9.089 -4.498 -4.498 -4.498 -9.089 -9.089 -9.089 -9.089 -0.500 electronvolt
mo.energy: -9.242 electronvolt
energy: -9.089 -9.089 -9.089 -9.089 -9.089 -9.089 -4.498 -9.089 -4.498 -4.498 -9.089 -9.089 -4.498 -9.089 -9.089 -9.089 -9.089 -0.500 -4.498 electronvolt
mo.energy: -9.231 electronvolt
energy: -9.089 -9.089 -9.089 -9.089 -9.089 -9.089 -9.089 -4.498 -9.089 -4.498 -9.089 -24.020 -24.020 -5.506 -4.498 -9.089 -24.020 electronvolt
mo.energy: -9.189 electronvolt
energy: -9.089 -9.089 -9.089 -9.089 -9.089 -4.498 -9.089 -9.089 -24.020 -5.506 -9.089 4.055 -9.089 -4.498 -4.498 electronvolt
mo.energy: -9.162 electronvolt
energy: -9.089 -9.089 -9.089 -9.089 -9.089 -9.089 -9.089 -9.089 -9.089 -4.498 -4.498 -4.498 -4.498 -24.020 -4.498 -24.020 -5.506 -9.089 -9.089 electronvolt
mo.energy: -9.122 electronvolt
energy: -9.089 -9.089 -9.089 -9.089 -9.089 -9.089 -9.089 -4.498 -9.089 -4.498 -9.089 -24.020 -4.498 -9.089 -4.498 -9.089 -9.089 -24.020 -24.020 electronvolt
mo.energy: -9.108 electronvolt
energy: -9.089 -9.089 -4.498 -9.089 -9.089 -9.089 -9.089 -9.089 -9.089 -9.089 -4.498 -9.089 -9.089 -4.498 -9.089 -9.089 electronvolt
mo.energy: -9.080 electronvolt
energy: -9.089 -9.089 -4.498 -9.089 -4.498 -9.089 -4.498 -9.089 -4.498 -9.089 -4.498 electronvolt
mo.energy: -9.024 electronvolt
energy: -9.089 -9.089 -4.498 -4.498 -9.089 -9.089 -0.500 electronvolt
mo.energy: -9.020 electronvolt
energy: -9.089 -9.089 -9.089 -4.498 -9.089 -4.498 -9.089 -9.089 -4.498 -9.089 -9.089 -9.089 -9.089 -4.498 -9.089 -9.089 -4.498 -9.089 -4.498 -4.498 -0.500 electronvolt
mo.energy: -9.016 electronvolt
energy: -9.089 -9.089 -4.498 -9.089 -9.089 -4.498 -0.500 electronvolt
mo.energy: -8.834 electronvolt
energy: -9.089 -9.089 -9.089 -9.089 -9.089 -9.089 -9.089 -9.089 -9.089 -9.089 -9.089 -9.089 -9.089 -4.498 -9.089 -9.089 -4.498 -9.089 -9.089 -0.500 -4.498 -4.498 electronvolt
mo.energy: -8.784 electronvolt
energy: -9.089 -9.089 -9.089 -9.089 -0.500 -0.500 -9.089 20.662 20.662 4.055 electronvolt
mo.energy: -8.758 electronvolt
energy: -9.089 -9.089 -9.089 -9.089 -9.089 -9.089 -9.089 -0.500 -0.500 20.662 20.662 electronvolt
mo.energy: -8.705 electronvolt
energy: -9.089 -9.089 -9.089 -9.089 -9.089 -9.089 -9.089 -9.089 -9.089 -9.089 -9.089 -9.089 -9.089 4.055 -9.089 electronvolt
mo.energy: -8.656 electronvolt
energy: -9.089 -9.089 -9.089 -4.498 -9.089 -9.089 -4.498 -9.089 -9.089 -0.500 -9.089 -0.500 -9.089 9.585 -4.498 electronvolt
mo.energy: -8.643 electronvolt
energy: -9.089 -9.089 -9.089 -9.089 -9.089 -9.089 -9.089 -9.089 -9.089 10.422 -9.089 -4.498 electronvolt
mo.energy: -8.626 electronvolt
energy: -9.089 -9.089 -9.089 -9.089 -9.089 -9.089 10.422 -9.089 -9.089 -4.498 -9.089 -9.089 -9.089 4.055 electronvolt
mo.energy: -8.534 electronvolt
energy: -9.089 -9.089 -9.089 -9.089 -9.089 -9.089 -9.089 -9.089 -9.089 -9.089 -9.089 -9.089 10.422 -9.089 -9.089 -9.089 -4.498 -9.089 -9.089 -9.089 -9.089 electronvolt
mo.energy: -8.466 electronvolt
energy: -9.089 -9.089 -9.089 -9.089 -9.089 -9.089 -9.089 -9.089 -9.089 -9.089 -9.089 -9.089 -0.500 -9.089 -0.500 -9.089 electronvolt
mo.energy: -8.460 electronvolt
energy: -9.089 -9.089 -9.089 -9.089 -9.089 -9.089 -9.089 -9.089 10.422 -9.089 -9.089 -9.089 -9.089 -9.089 -4.498 -9.089 -4.498 -9.089 electronvolt
mo.energy: -8.425 electronvolt
energy: -9.089 -9.089 -9.089 -4.498 -9.089 -9.089 -9.089 -9.089 -9.089 -9.089 -9.089 -9.089 -4.498 -9.089 -4.498 -4.498 -4.498 -4.498 electronvolt
mo.energy: -8.393 electronvolt
energy: -9.089 -9.089 -9.089 -9.089 -9.089 -9.089 -9.089 -9.089 -9.089 -9.089 -9.089 -9.089 -9.089 10.422 2.188 electronvolt
mo.energy: -8.377 electronvolt
energy: -9.089 -9.089 -9.089 -9.089 -9.089 -9.089 -9.089 -0.500 -4.498 -9.089 -9.089 -9.089 -4.498 electronvolt
mo.energy: -8.126 electronvolt
energy: -9.089 -9.089 -9.089 -9.089 -9.089 -9.089 -9.089 -9.089 -9.089 -9.089 -0.500 electronvolt
mo.energy: -8.056 electronvolt
energy: -9.089 -9.089 -9.089 -9.089 -9.089 -9.089 -9.089 -9.089 -0.500 -9.089 -9.089 -9.089 -9.089 electronvolt
mo.energy: -7.972 electronvolt
energy: -9.089 -9.089 -9.089 -9.089 -9.089 -9.089 -9.089 -9.089 -9.089 -9.089 -9.089 -9.089 -9.089 -9.089 -9.089 -9.089 -9.089 -9.089 -9.089 -9.089 -0.500 -9.089 electronvolt
mo.energy: -7.943 electronvolt
energy: -9.089 -9.089 -9.089 -9.089 -9.089 -9.089 -9.089 -9.089 -9.089 -9.089 -9.089 -4.498 -0.500 electronvolt
mo.energy: -7.876 electronvolt
energy: -9.089 -9.089 -9.089 -9.089 -9.089 -9.089 -9.089 -9.089 -9.089 -9.089 -9.089 10.422 electronvolt
mo.energy: -7.866 electronvolt
energy: -9.089 -9.089 -9.089 -9.089 -9.089 -9.089 -9.089 -9.089 -9.089 -9.089 electronvolt
mo.energy: -7.825 electronvolt
energy: -9.089 -4.498 -9.089 -4.498 -9.089 -9.089 -9.089 -9.089 -4.498 -4.498 electronvolt
mo.energy: -7.819 electronvolt
energy: -9.089 -9.089 -9.089 -9.089 -9.089 -9.089 -9.089 -9.089 -9.089 -9.089 -9.089 -9.089 -9.089 -9.089 -9.089 -9.089 -9.089 -9.089 electronvolt
mo.energy: -7.786 electronvolt
energy: -9.089 -9.089 -9.089 -9.089 -9.089 -9.089 -9.089 -9.089 -9.089 -9.089 -9.089 -9.089 -9.089 -9.089 -9.089 -9.089 electronvolt
mo.energy: -7.633 electronvolt
energy: -9.089 -9.089 -9.089 -9.089 -9.089 -9.089 -9.089 -9.089 -9.089 -9.089 -9.089 -9.089 -9.089 -9.089 -9.089 -0.500 -9.089 electronvolt
mo.energy: -7.603 electronvolt
energy: -9.089 -9.089 -9.089 -9.089 -9.089 -9.089 -9.089 -9.089 -9.089 -9.089 -9.089 -9.089 -9.089 -9.089 -9.089 -9.089 -9.089 -9.089 -9.089 -9.089 -9.089 -9.089 -9.089 -9.089 -9.089 electronvolt
mo.energy: -7.582 electronvolt
energy: -9.089 -9.089 -9.089 -9.089 -9.089 -9.089 -9.089 -9.089 -9.089 -9.089 -9.089 -9.089 -9.089 -9.089 -9.089 -9.089 -9.089 electronvolt
mo.energy: -7.535 electronvolt
energy: -9.089 -9.089 -9.089 -9.089 -9.089 -9.089 -9.089 -9.089 electronvolt
mo.energy: -7.490 electronvolt
energy: -9.089 -9.089 -9.089 -9.089 -9.089 -9.089 -9.089 10.422 -9.089 -9.089 -9.089 9.585 electronvolt
mo.energy: -7.467 electronvolt
energy: -9.089 -9.089 -9.089 -9.089 -9.089 -9.089 -9.089 -9.089 -9.089 -9.089 -9.089 -9.089 -9.089 -9.089 -9.089 -9.089 -9.089 -9.089 10.422 electronvolt
mo.energy: -7.449 electronvolt
energy: -9.089 -9.089 -9.089 -9.089 -9.089 -9.089 -9.089 -9.089 -9.089 -0.500 -9.089 electronvolt
mo.energy: -7.389 electronvolt
energy: -9.089 -9.089 -9.089 -9.089 -9.089 -9.089 -9.089 -9.089 -9.089 -9.089 -9.089 -9.089 -9.089 -9.089 -9.089 electronvolt
mo.energy: -7.382 electronvolt
energy: -9.089 -9.089 -9.089 -9.089 -9.089 -9.089 -9.089 -9.089 -9.089 -9.089 -9.089 -9.089 -9.089 electronvolt
mo.energy: -7.374 electronvolt
mo.energy: -7.332 electronvolt
energy: -9.089 -9.089 -9.089 -9.089 -9.089 -9.089 -9.089 -9.089 -9.089 -9.089 -9.089 -9.089 -9.089 -9.089 electronvolt
mo.energy: -7.298 electronvolt
energy: -9.089 -9.089 -9.089 -9.089 -9.089 -9.089 -9.089 -9.089 -9.089 -9.089 -9.089 -9.089 -9.089 -9.089 -9.089 -4.498 -9.089 -9.089 electronvolt
mo.energy: -7.287 electronvolt
mo.energy: -7.285 electronvolt
mo.energy: -7.216 electronvolt
energy: -9.089 -9.089 -9.089 -9.089 -9.089 -9.089 -9.089 -9.089 -9.089 -9.089 -9.089 -9.089 -9.089 -9.089 -9.089 -9.089 -9.089 -9.089 -9.089 -9.089 -9.089 electronvolt
mo.energy: -7.211 electronvolt
mo.energy: -7.176 electronvolt
mo.energy: -7.129 electronvolt
mo.energy: -7.105 electronvolt
energy: -9.089 -9.089 -9.089 -9.089 -9.089 -9.089 -9.089 -9.089 -9.089 -9.089 -9.089 electronvolt
mo.energy: -7.103 electronvolt
mo.energy: -7.073 electronvolt
energy: -9.089 -9.089 -9.089 -9.089 -9.089 -9.089 -9.089 -9.089 9.585 electronvolt
mo.energy: -7.055 electronvolt
mo.energy: -7.049 electronvolt
mo.energy: -6.992 electronvolt
energy: -9.089 -9.089 -9.089 -9.089 -9.089 -9.089 9.585 electronvolt
mo.energy: -6.897 electronvolt
mo.energy: -6.884 electronvolt
mo.energy: -6.787 electronvolt
energy: -9.089 -9.089 -9.089 -9.089 -9.089 -9.089 -9.089 -9.089 -9.089 -9.089 9.585 electronvolt
mo.energy: -6.762 electronvolt
energy: -9.089 -9.089 -9.089 -9.089 -9.089 -9.089 -9.089 -9.089 -9.089 electronvolt
mo.energy: -6.700 electronvolt
mo.energy: -4.378 electronvolt
energy: -4.498 -9.089 -4.498 -4.498 -9.089 -4.498 -9.089 4.055 9.585 -9.089 electronvolt
mo.energy: -4.174 electronvolt
energy: -4.498 -4.498 -9.089 -4.498 -9.089 -4.498 -4.498 -4.498 -4.498 -9.089 -9.089 -4.498 4.055 electronvolt
mo.energy: -3.662 electronvolt
energy: -4.498 -4.498 -4.498 -4.498 -9.089 -9.089 -9.089 -9.089 -9.089 -9.089 -4.498 -9.089 4.055 electronvolt
mo.energy: -3.285 electronvolt
energy: -4.498 -4.498 -9.089 -4.498 -4.498 -9.089 -9.089 -9.089 -4.498 -9.089 -9.089 -9.089 -4.498 -9.089 4.055 -9.089 -4.498 electronvolt
mo.energy: -2.990 electronvolt
energy: -4.498 -4.498 -9.089 -9.089 -9.089 -4.498 -4.498 -9.089 -9.089 -9.089 -9.089 electronvolt
mo.energy: -2.937 electronvolt
energy: -4.498 -9.089 -4.498 -4.498 -9.089 -4.498 -4.498 -9.089 -9.089 4.055 -4.498 electronvolt
mo.energy: -2.932 electronvolt
energy: -4.498 -9.089 -4.498 -4.498 -9.089 -4.498 -9.089 -9.089 -4.498 -4.498 -4.498 -9.089 -4.498 -4.498 -9.089 -4.498 -9.089 -9.089 electronvolt
mo.energy: -2.917 electronvolt
energy: -4.498 -9.089 -4.498 -4.498 -9.089 -4.498 -9.089 -4.498 -9.089 -4.498 9.585 4.055 4.055 electronvolt
mo.energy: -2.862 electronvolt
energy: -4.498 -9.089 -9.089 4.055 -9.089 -9.089 -4.498 -4.498 9.585 electronvolt
mo.energy: -2.840 electronvolt
energy: -4.498 -9.089 -4.498 -4.498 -9.089 -9.089 -9.089 4.055 -9.089 -4.498 -4.498 -9.089 electronvolt
mo.energy: -2.835 electronvolt
energy: -4.498 -9.089 -4.498 -4.498 -9.089 -4.498 -4.498 -9.089 -9.089 -9.089 -4.498 -9.089 -9.089 -4.498 -4.498 4.055 -4.498 electronvolt
mo.energy: -2.715 electronvolt
energy: -4.498 -4.498 -9.089 -9.089 -4.498 -4.498 -9.089 -4.498 -9.089 4.055 9.585 -4.498 electronvolt
mo.energy: -2.670 electronvolt
energy: -4.498 -4.498 -4.498 -4.498 -9.089 -9.089 -9.089 -4.498 -4.498 -9.089 -9.089 -4.498 -4.498 -4.498 -4.498 -9.089 -9.089 4.055 electronvolt
mo.energy: -2.628 electronvolt
energy: -4.498 -4.498 -4.498 -9.089 -9.089 -9.089 -9.089 -4.498 -4.498 -9.089 -4.498 -4.498 -4.498 -4.498 -9.089 4.055 -9.089 -9.089 electronvolt
mo.energy: -2.627 electronvolt
energy: -4.498 -9.089 -4.498 -4.498 -4.498 -9.089 -9.089 -9.089 4.055 4.055 9.585 electronvolt
mo.energy: -2.600 electronvolt
energy: -4.498 -4.498 -9.089 -4.498 -4.498 -4.498 -9.089 -4.498 -9.089 -9.089 -4.498 -9.089 -9.089 -9.089 -4.498 -9.089 -4.498 -9.089 -9.089 -4.498 -4.498 electronvolt
mo.energy: -2.561 electronvolt
energy: -4.498 -4.498 -9.089 -4.498 -4.498 -4.498 -9.089 -9.089 -9.089 -9.089 -9.089 4.055 4.055 4.055 electronvolt
mo.energy: -2.469 electronvolt
energy: -4.498 -4.498 -9.089 -9.089 -9.089 -4.498 -9.089 -4.498 -9.089 4.055 -9.089 -4.498 -4.498 -9.089 -4.498 electronvolt
mo.energy: -2.432 electronvolt
energy: -4.498 -9.089 -4.498 -4.498 -4.498 -4.498 -4.498 -9.089 -9.089 4.055 -9.089 -4.498 -9.089 -9.089 -9.089 -9.089 -9.089 -9.089 -4.498 -9.089 -9.089 electronvolt
mo.energy: -2.307 electronvolt
energy: -4.498 -4.498 -9.089 -4.498 -9.089 -4.498 -9.089 -4.498 -4.498 -9.089 -9.089 -9.089 -9.089 4.055 electronvolt
mo.energy: -2.239 electronvolt
energy: -4.498 -4.498 -9.089 -4.498 -4.498 -4.498 -9.089 -9.089 -9.089 -4.498 -9.089 -9.089 -9.089 4.055 -4.498 -4.498 4.055 -9.089 -4.498 electronvolt
mo.energy: -2.069 electronvolt
energy: -4.498 -4.498 -4.498 -9.089 -4.498 -9.089 -9.089 -4.498 -9.089 -9.089 -4.498 -9.089 4.055 -9.089 4.055 electronvolt
mo.energy: -2.052 electronvolt
energy: -4.498 -4.498 -9.089 -4.498 -9.089 -4.498 -9.089 4.055 -9.089 -4.498 electronvolt
mo.energy: -1.945 electronvolt
energy: -4.498 -9.089 -4.498 -4.498 -4.498 -9.089 4.055 -9.089 -9.089 -4.498 -9.089 -9.089 -4.498 -9.089 -4.498 4.055 -0.500 -9.089 electronvolt
mo.energy: -1.940 electronvolt
energy: -4.498 -4.498 -4.498 -9.089 -4.498 -9.089 -9.089 -9.089 -9.089 -9.089 4.055 -9.089 -4.498 electronvolt
mo.energy: -1.646 electronvolt
energy: -4.498 -4.498 -4.498 -4.498 -9.089 -9.089 -4.498 -9.089 -9.089 -9.089 -9.089 4.055 -9.089 -13.975 -9.089 -24.020 -4.498 4.055 -9.089 -9.089 -4.498 electronvolt
mo.energy: -1.644 electronvolt
energy: -4.498 -4.498 -9.089 -9.089 -4.498 -4.498 -9.089 -4.498 -9.089 -9.089 -9.089 -9.089 -4.498 -9.089 -4.498 -9.089 4.055 4.055 -4.498 electronvolt
mo.energy: -1.636 electronvolt
energy: -4.498 -4.498 -9.089 -9.089 -9.089 -9.089 -9.089 -4.498 -4.498 4.055 4.055 electronvolt
mo.energy: -1.527 electronvolt
energy: -4.498 -4.498 -4.498 -4.498 -9.089 -9.089 -4.498 -9.089 -9.089 4.055 -4.498 -9.089 -4.498 -9.089 -9.089 -9.089 -9.089 4.055 -9.089 -9.089 -9.089 electronvolt
mo.energy: -1.497 electronvolt
energy: -4.498 -4.498 -9.089 -4.498 -4.498 -4.498 -9.089 -4.498 -9.089 -9.089 -9.089 -9.089 4.055 -9.089 -9.089 -9.089 -9.089 -4.498 -4.498 -4.498 -9.089 electronvolt
mo.energy: -1.478 electronvolt
energy: -4.498 -9.089 -4.498 -9.089 -9.089 -9.089 4.055 -9.089 -4.498 -9.089 -4.498 electronvolt
mo.energy: -1.464 electronvolt
energy: -4.498 -4.498 -9.089 -9.089 -4.498 -4.498 -9.089 -4.498 -9.089 4.055 4.055 4.055 -9.089 -9.089 -4.498 electronvolt
mo.energy: -1.432 electronvolt
energy: -4.498 -4.498 -4.498 -4.498 -4.498 -9.089 -9.089 -9.089 -9.089 -9.089 -9.089 -9.089 -9.089 -4.498 -9.089 4.055 -9.089 4.055 -9.089 4.055 -5.506 electronvolt
mo.energy: -1.426 electronvolt
energy: -4.498 -4.498 -9.089 -9.089 -9.089 -9.089 4.055 -4.498 -9.089 -4.498 4.055 -24.020 -4.498 electronvolt
mo.energy: -1.224 electronvolt
energy: -4.498 -4.498 -9.089 -4.498 -4.498 -9.089 -9.089 -9.089 -4.498 -9.089 -4.498 4.055 4.055 -9.089 -9.089 -9.089 -4.498 -4.498 -9.089 electronvolt
mo.energy: -1.118 electronvolt
energy: -4.498 -4.498 -4.498 -9.089 -9.089 -4.498 -9.089 4.055 -9.089 4.055 -9.089 -9.089 -9.089 -9.089 -9.089 -4.498 -9.089 -9.089 4.055 -4.498 electronvolt
mo.energy: -0.431 electronvolt
energy: -4.498 -4.498 1.231 -5.688 -9.089 -9.089 -13.975 -9.089 -0.500 -4.498 -9.089 -0.500 -4.498 -9.089 24.654 -24.020 -24.020 -24.020 electronvolt
mo.energy: -0.221 electronvolt
energy: -4.498 -4.498 -4.498 -4.498 -4.498 -24.020 -4.498 -24.020 -4.498 -9.089 -9.089 -9.089 -4.498 -9.089 -9.089 -9.089 -9.089 4.055 -4.498 -5.688 -24.020 -0.500 24.654 -4.498 24.654 electronvolt
mo.energy: -0.213 electronvolt
energy: -4.498 1.231 -4.498 1.231 -5.688 -5.688 -9.089 -9.089 -4.498 -4.498 -9.089 24.654 -13.975 -24.020 4.055 -9.089 -9.089 24.654 -9.089 -0.500 electronvolt
mo.energy: -0.163 electronvolt
energy: -4.498 -4.498 -9.089 -9.089 -0.500 -9.089 -24.020 -9.089 -13.975 -4.498 4.055 -24.020 -9.089 24.654 -0.500 -24.020 24.654 -9.089 electronvolt
mo.energy: 0.007 electronvolt
energy: 1.231 1.231 -4.498 -5.688 -5.688 -4.498 -0.500 -4.498 -9.089 -0.500 -0.500 -9.089 -24.020 -9.089 24.654 -4.498 -9.089 15.256 -0.500 -9.089 electronvolt
mo.energy: 0.018 electronvolt
energy: -4.498 1.231 1.231 -5.688 -9.089 -4.498 -9.089 -0.500 -5.688 -4.498 -24.020 -9.089 24.654 -13.975 -0.500 -4.498 2.188 -9.089 -9.089 -9.089 -24.020 electronvolt
mo.energy: 0.245 electronvolt
energy: 1.231 -5.688 1.231 -4.498 2.188 -9.089 -0.500 -0.500 -9.089 -5.688 9.585 -24.020 -0.500 -9.089 -4.498 24.654 -24.020 24.654 3.091 4.055 electronvolt
mo.energy: 0.315 electronvolt
energy: 1.231 -5.688 1.231 2.188 -5.688 1.231 -4.498 -5.688 -0.500 -4.498 -0.500 -5.506 24.654 -4.498 -9.089 -4.498 electronvolt
mo.energy: 0.330 electronvolt
energy: -4.498 -4.498 -4.498 -4.498 -4.498 -9.089 -5.688 -24.020 -0.500 -9.089 -9.089 -9.089 -9.089 -0.500 -4.498 -24.020 -9.089 24.654 -4.498 -0.500 -9.089 electronvolt
mo.energy: 0.437 electronvolt
energy: -4.498 -4.498 1.231 -5.688 -4.498 -5.688 2.188 -9.089 -4.498 -4.498 -9.089 -9.089 -4.498 1.231 1.231 -4.498 -9.089 -4.498 4.055 -4.498 -24.020 -24.020 -24.020 -5.688 -5.506 -24.020 -9.089 4.055 electronvolt
mo.energy: 0.474 electronvolt
energy: -4.498 -4.498 -4.498 -9.089 -4.498 -24.020 -9.089 -24.020 -0.500 -9.089 4.055 -5.688 -9.089 -9.089 -9.089 -4.498 24.654 4.055 -9.089 24.654 electronvolt
mo.energy: 0.595 electronvolt
energy: 1.231 -5.688 1.231 -5.688 -4.498 -4.498 2.188 -9.089 -0.500 24.654 -4.498 -4.498 -24.020 24.654 -0.500 -24.020 -9.089 electronvolt
mo.energy: 0.709 electronvolt
energy: -4.498 -5.688 1.231 1.231 -5.688 -4.498 -9.089 -9.089 -0.500 -4.498 -4.498 -24.020 2.188 -9.089 -4.498 -4.498 -5.688 9.585 -9.089 -0.500 -24.020 -9.089 electronvolt
mo.energy: 0.732 electronvolt
energy: 1.231 -5.688 -4.498 1.231 1.231 -4.498 -5.688 -5.688 2.188 -4.498 -0.500 -4.498 -9.089 -4.498 -4.498 -5.506 -9.089 -0.500 -9.089 24.654 -9.089 -9.089 electronvolt
mo.energy: 0.766 electronvolt
energy: -5.688 1.231 -5.688 1.231 -4.498 -5.688 -0.500 -9.089 -0.500 24.654 1.231 -4.498 4.055 -5.506 -0.500 -24.020 -9.089 9.585 4.055 electronvolt
mo.energy: 0.824 electronvolt
energy: -4.498 -9.089 -4.498 -4.498 -0.500 -9.089 -9.089 -4.498 -4.498 -9.089 -5.688 -0.500 -24.020 -5.688 -4.498 -9.089 -4.498 -24.020 24.654 electronvolt
mo.energy: 1.026 electronvolt
energy: -5.688 1.231 -5.688 1.231 -4.498 -0.500 4.055 -4.498 -4.498 -4.498 24.654 -24.020 -4.498 -9.089 4.055 24.654 -9.089 9.585 -9.089 9.585 -13.975 electronvolt
