program: Orca
programVersion: 5.0.1
elementType: C C C C C C H H H H C H O N O H
charge: -1
multiplicity: 1
keywords: B3LYP OPT FREQ def2-TZVP
frequency: 0.00 0.00 0.00 0.00 0.00 0.00 55.25 129.45 169.67 277.82 314.07 368.09 418.03 433.20 496.98 560.63 634.62 653.28 686.54 687.58 745.44 837.46 881.72 906.80 912.87 962.74 1008.37 1040.41 1069.32 1093.15 1167.59 1188.06 1217.42 1266.79 1322.47 1346.43 1468.57 1511.77 1540.22 1588.08 1618.74 1650.57 3131.19 3139.00 3158.72 3167.67 3190.79 3419.36
frequency: 55.25 129.45 169.67 277.82 314.07 368.09 418.03 433.20 496.98 560.63 634.62 653.28 686.54 687.58 745.44 837.46 881.72 906.80 912.87 962.74 1008.37 1040.41 1069.32 1093.15 1167.59 1188.06 1217.42 1266.79 1322.47 1346.43 1468.57 1511.77 1540.22 1588.08 1618.74 1650.57 3131.19 3139.00 3158.72 3167.67 3190.79 3419.36
formula: C7H6NO2
InChI: InChI=1S/C7H6NO2/c9-7(8-10)6-4-2-1-3-5-6/h1-5,8H
16 atoms
C  2.195638 -0.007894 0.36149
C  1.744233 -1.323655 0.279984
C  0.432293 -1.55643 -0.131927
C  -0.410952 -0.497341 -0.442308
C  1.352416 1.050144 0.051833
C  0.018731 0.838262 -0.337738
H  3.217909 0.193445 0.665958
H  2.403689 -2.151377 0.515056
H  0.068061 -2.573944 -0.230049
H  1.692112 2.076996 0.091548
C  -0.797562 2.059353 -0.651339
H  -1.406526 -0.721831 -0.806336
O  -0.238158 3.150334 -0.879446
N  -2.127968 1.854986 -0.611717
O  -3.084855 2.730849 -0.811771
H  -2.425642 0.926444 -0.325628
totalener: -475.45388645 hartree
nucrepener: 473.14097882 hartree
electener: -948.59486527 hartree
oneelecener: -1596.82631622 hartree
twoeener: 648.23145095 hartree
kineticenergy: 473.45702390 hartree
exchangeener: -49.084576468479 hartree
correlationener: -2.910706465303 hartree
xcener: -51.995282933781 hartree
chargesum: -1.0000000
charge: -0.073152 -0.137023 -0.109108 -0.216795 -0.194456 0.079571 0.065229 0.062312 0.062802 0.107882 0.162869 0.076142 -0.485144 0.046996 -0.617737 0.169612
charge: -0.169486 -0.189714 -0.177055 -0.141025 -0.110265 -0.111675 0.129451 0.125486 0.128645 0.148264 -0.491336 0.131680 -0.053758 0.001255 -0.370073 0.149608
qa: -0.0732 -0.1370 -0.1091 -0.2168 -0.1945 0.0796 0.0652 0.0623 0.0628 0.1079 0.1629 0.0761 -0.4851 0.0470 -0.6177 0.1696
va: 3.8169 3.8903 3.9036 3.9752 3.9344 3.6432 0.9687 0.9688 0.9701 1.0290 4.4157 1.0016 2.0581 3.4150 1.5500 0.9857
energy: -475.464064998029
dipole: 4.30642 -2.34510 1.96132 -7.19682 3.93059 -3.26623 1.80859 -0.99488 0.81370
magnitude: 3.89578 au
magnitude: 9.90229 debye
temp: 298.15 k
press: 1.00 atm
zeropoint: 0.11718196 hartree
thermalvibcorrection: 0.00539502 hartree
thermalrotcorrection: 0.00141627 hartree
thermaltrasncorrection: 0.00141627 hartree
thermaltotal: -475.33865547 hartree
thermalcorr: 0.00822757 hartree
nonthermalcorr: 0.11718196 hartree
totalcorr: 0.12540952 hartree
thermalcorrenthalpy: 0.00094421 hartree
totalenthalpy: -475.33771126 hartree
totalentropycorr: -0.04220709 hartree
gibbsenthalpy: -475.37991836 hartree
gibbsminuselec: 0.08414664 hartree
