program: AMS
programVersion: 2021.106
runtype: GEOMETRY OPTIMIZATION
method: DFT
functional: PBEc PBEx
spinMolecule: Restricted
epsl: 78.39000
solvent: Water angstrom
functional: PW92 == Not Default ==
formula: As2O62W18
InChI: InChI=1S/2AsO4.54O.18W/c2*2-1(3,4)5;;;;;;;;;;;;;;;;;;;;;;;;;;;;;;;;;;;;;;;;;;;;;;;;;;;;;;;;;;;;;;;;;;;;;;;;
82 atoms
As 0.000000 0.000000 -1.940525
O  1.627153 -0.000000 -1.438701
W  3.156224 -1.713408 -1.899410
O  4.460823 -2.788598 -2.281486
O  1.682780 -2.914661 -1.568156
W  -0.094258 -3.590074 -1.899410
O  0.184585 -5.257484 -2.281486
O  -0.813577 -1.409156 -1.438701
W  -3.061966 -1.876666 -1.899410
O  -4.645408 -2.468887 -2.281486
O  -3.365560 -0.000000 -1.568156
W  -3.061966 1.876666 -1.899410
O  -4.645408 2.468887 -2.281486
O  -2.591559 -1.305957 -3.704295
W  -1.974527 -0.000000 -4.972859
O  -3.237548 0.000000 -6.160300
O  -3.123342 -2.173860 0.000000
W  -3.061966 -1.876666 1.899410
O  -4.645408 -2.468887 2.281486
O  -2.020714 -3.499980 -2.143403
O  0.164788 -2.897334 -3.704295
W  0.987263 -1.709990 -4.972859
O  1.618774 -2.803799 -6.160300
O  -0.000000 -0.000000 -3.682804
W  0.987263 1.709990 -4.972859
O  1.618774 2.803799 -6.160300
O  2.426771 -1.591378 -3.704295
O  1.552933 -0.000000 -5.721653
O  -0.776466 -1.344879 -5.721653
O  -0.320947 -3.791824 0.000000
W  -0.094258 -3.590074 1.899410
O  0.184585 -5.257484 2.281486
O  -2.591559 1.305957 -3.704295
O  -0.776466 1.344879 -5.721653
O  -0.813577 1.409156 -1.438701
W  -0.094258 3.590074 -1.899410
O  0.184585 5.257484 -2.281486
O  0.164788 2.897334 -3.704295
O  1.682780 2.914661 -1.568156
W  3.156224 1.713408 -1.899410
O  4.460823 2.788598 -2.281486
O  2.426771 1.591378 -3.704295
O  4.041429 -0.000000 -2.143403
O  3.444290 1.617964 0.000000
W  3.156224 1.713408 1.899410
O  4.460823 2.788598 2.281486
O  -2.020714 3.499980 -2.143403
O  -0.320947 3.791824 0.000000
W  -0.094258 3.590074 1.899410
O  0.184585 5.257484 2.281486
O  -3.123342 2.173860 0.000000
W  -3.061966 1.876666 1.899410
O  -4.645408 2.468887 2.281486
O  3.444290 -1.617964 0.000000
W  3.156224 -1.713408 1.899410
O  4.460823 -2.788598 2.281486
O  1.627153 -0.000000 1.438701
O  -0.000000 -0.000000 3.682804
W  0.987263 1.709990 4.972859
O  1.618774 2.803799 6.160300
O  -0.813577 1.409156 1.438701
O  -0.813577 -1.409156 1.438701
O  2.426771 1.591378 3.704295
O  1.682780 2.914661 1.568156
O  4.041429 -0.000000 2.143403
O  -3.365560 -0.000000 1.568156
O  -2.591559 -1.305957 3.704295
W  -1.974527 -0.000000 4.972859
O  -3.237548 0.000000 6.160300
O  -2.020714 -3.499980 2.143403
O  1.682780 -2.914661 1.568156
O  0.164788 -2.897334 3.704295
W  0.987263 -1.709990 4.972859
O  1.618774 -2.803799 6.160300
O  2.426771 -1.591378 3.704295
O  1.552933 -0.000000 5.721653
O  -0.776466 -1.344879 5.721653
O  -2.591559 1.305957 3.704295
O  -0.776466 1.344879 5.721653
O  0.164788 2.897334 3.704295
O  -2.020714 3.499980 2.143403
As 0.000000 0.000000 1.940525
elementType: As O W O O W O O W O O W O O W O O W O O O W O O W O O O O O W O O O O W O O O W O O O O W O O O W O O W O O W O O O W O O O O O O O O W O O O O W O O O O O O O O As
mdcq: 1.67277003 -0.79218685 2.04801629 -0.66542485 -0.76555453 2.04872693 -0.66679397 -0.78465962 2.04987757 -0.66457376 -0.77438349 2.04987755 -0.66457376 -0.77523805 2.02800371 -0.66011997 -0.73559585 2.04987757 -0.66457376 -0.78048755 -0.77577297 2.03298498 -0.66155037 -0.81300002 2.03298499 -0.66155037 -0.77653356 -0.80071311 -0.79929122 -0.73544221 2.04872691 -0.66679397 -0.77523805 -0.79929121 -0.78465962 2.04872694 -0.66679396 -0.77577297 -0.76555453 2.04801628 -0.66542485 -0.77653356 -0.78047484 -0.73630803 2.04801629 -0.66542485 -0.78048756 -0.73544221 2.04872693 -0.66679396 -0.73559586 2.04987756 -0.66457376 -0.73630802 2.04801629 -0.66542485 -0.79218685 -0.81300002 2.03298498 -0.66155037 -0.78465962 -0.78465962 -0.77653356 -0.76555453 -0.78047485 -0.77438349 -0.77523805 2.02800372 -0.66011997 -0.78048756 -0.76555453 -0.77577297 2.03298499 -0.66155037 -0.77653355 -0.80071311 -0.79929122 -0.77523804 -0.79929122 -0.77577297 -0.78048756 1.67277003
eener: -641.177101 electronvolt
kinener: 643.731511 electronvolt
coulombener: -61.437816 electronvolt
xcener: -617.703891 electronvolt
solvener: -35.585435 electronvolt
dispener: 0.000000 electronvolt
total: -712.172729 electronvolt
charge: 2.40921710 -1.03760129 2.58154376 -0.77112480 -0.95937373 2.58154376 -0.77112480 -1.03760129 2.58154376 -0.77112480 -0.95937373 2.58154376 -0.77112480 -0.95366084 2.55162803 -0.77887599 -0.96190997 2.58154376 -0.77112480 -0.98379442 -0.95366084 2.55162803 -0.77887599 -1.14212696 2.55162803 -0.77887599 -0.95366084 -0.96595225 -0.96595225 -0.96190997 2.58154376 -0.77112480 -0.95366084 -0.96595225 -1.03760129 2.58154376 -0.77112480 -0.95366084 -0.95937373 2.58154376 -0.77112480 -0.95366084 -0.98379442 -0.96190997 2.58154376 -0.77112480 -0.98379442 -0.96190997 2.58154376 -0.77112480 -0.96190997 2.58154376 -0.77112480 -0.96190997 2.58154376 -0.77112480 -1.03760129 -1.14212696 2.55162803 -0.77887599 -1.03760129 -1.03760129 -0.95366084 -0.95937373 -0.98379442 -0.95937373 -0.95366084 2.55162803 -0.77887599 -0.98379442 -0.95937373 -0.95366084 2.55162803 -0.77887599 -0.95366084 -0.96595225 -0.96595225 -0.95366084 -0.96595225 -0.95366084 -0.98379442 2.40921710
quadrupole: 75.65531574 -0.00000000 0.00000000 75.65534812 -0.00000000 -151.31066386
charge: -6
converged: GEOMETRY CONVERGED
mo.energy: -24.535 electronvolt
energy: -24.020 -24.020 -24.020 -24.020 -5.206 -24.020 -5.688 -24.020 electronvolt
mo.energy: -24.492 electronvolt
energy: -24.020 -24.020 -24.020 -24.020 -24.020 -5.688 -5.206 -24.020 electronvolt
mo.energy: -24.401 electronvolt
energy: -24.020 -24.020 -24.020 -24.020 -24.020 -24.020 -24.020 -24.020 -5.688 -5.206 2.716 electronvolt
mo.energy: -24.359 electronvolt
energy: -24.020 -24.020 -24.020 -24.020 -24.020 -24.020 -4.498 -24.020 -5.688 electronvolt
mo.energy: -24.217 electronvolt
energy: -24.020 -24.020 -24.020 -24.020 -24.020 -5.688 -24.020 -5.206 2.716 electronvolt
mo.energy: -24.191 electronvolt
energy: -24.020 -24.020 -24.020 -24.020 -24.020 -4.498 -24.020 -4.498 electronvolt
mo.energy: -24.045 electronvolt
energy: -24.020 -24.020 -24.020 -24.020 -24.020 -24.020 -24.020 -4.498 electronvolt
mo.energy: -23.851 electronvolt
energy: -24.020 -24.020 -24.020 -24.020 -24.020 -24.020 -24.020 -4.498 -4.498 -4.498 electronvolt
mo.energy: -23.833 electronvolt
energy: -24.020 -24.020 -24.020 -24.020 -24.020 -4.498 2.716 -4.498 -24.020 electronvolt
mo.energy: -23.808 electronvolt
energy: -24.020 -24.020 -24.020 -24.020 -24.020 -24.020 -4.498 -4.498 2.716 -4.498 electronvolt
energy: -24.020 -24.020 -24.020 -24.020 -24.020 -24.020 -4.498 -24.020 -4.498 -4.498 electronvolt
mo.energy: -23.799 electronvolt
energy: -24.020 -24.020 -4.498 4.055 -24.020 -4.498 electronvolt
mo.energy: -23.664 electronvolt
energy: -24.020 -24.020 -24.020 -24.020 -24.020 -24.020 -4.498 -4.498 -4.498 electronvolt
mo.energy: -23.650 electronvolt
energy: -24.020 -24.020 -24.020 -24.020 -24.020 -4.498 -24.020 -24.020 -4.498 -24.020 -4.498 electronvolt
mo.energy: -23.462 electronvolt
energy: -24.020 -24.020 -4.498 -24.020 -24.020 -24.020 -24.020 electronvolt
mo.energy: -23.434 electronvolt
energy: -24.020 -24.020 -24.020 -24.020 -24.020 -4.498 -4.498 -4.498 electronvolt
mo.energy: -23.397 electronvolt
energy: -24.020 -24.020 -24.020 -24.020 -4.498 -4.498 -24.020 -24.020 -24.020 electronvolt
mo.energy: -23.318 electronvolt
energy: -24.020 -4.498 -24.020 -4.498 -4.498 electronvolt
mo.energy: -23.229 electronvolt
energy: -24.020 -24.020 -24.020 -24.020 -24.020 -24.020 -4.498 electronvolt
mo.energy: -23.209 electronvolt
energy: -24.020 -24.020 -24.020 -24.020 -24.020 -4.498 electronvolt
mo.energy: -23.068 electronvolt
energy: -24.020 -24.020 -24.020 -4.498 electronvolt
mo.energy: -23.047 electronvolt
energy: -24.020 -24.020 -24.020 -24.020 -24.020 -24.020 -4.498 -24.020 electronvolt
mo.energy: -22.955 electronvolt
energy: -24.020 -24.020 -24.020 -24.020 -24.020 -24.020 -24.020 electronvolt
mo.energy: -22.943 electronvolt
mo.energy: -22.897 electronvolt
energy: -24.020 -24.020 -24.020 -4.498 -4.498 electronvolt
mo.energy: -22.883 electronvolt
energy: -24.020 -24.020 -24.020 -24.020 -24.020 -24.020 electronvolt
mo.energy: -22.879 electronvolt
energy: -24.020 -4.498 -24.020 1.231 -4.498 -5.688 electronvolt
mo.energy: -22.867 electronvolt
mo.energy: -22.866 electronvolt
energy: -24.020 -4.498 -24.020 -43.195 -24.020 -0.500 -4.498 electronvolt
mo.energy: -22.863 electronvolt
energy: -24.020 -24.020 -4.498 -24.020 -24.020 -4.498 -24.020 electronvolt
mo.energy: -22.862 electronvolt
energy: -24.020 -24.020 -4.498 -24.020 -24.020 -4.498 electronvolt
mo.energy: -22.860 electronvolt
mo.energy: -22.855 electronvolt
energy: -24.020 -24.020 -24.020 -4.498 -24.020 -24.020 -4.498 electronvolt
mo.energy: -22.850 electronvolt
energy: -24.020 -4.498 -24.020 -24.020 -24.020 -4.498 -24.020 electronvolt
mo.energy: -22.846 electronvolt
mo.energy: -22.811 electronvolt
energy: -24.020 -24.020 -4.498 -4.498 -0.500 electronvolt
mo.energy: -22.807 electronvolt
energy: -24.020 -24.020 -4.498 -43.195 electronvolt
mo.energy: -22.798 electronvolt
mo.energy: -22.797 electronvolt
energy: -24.020 -24.020 -4.498 -24.020 electronvolt
mo.energy: -22.761 electronvolt
energy: -24.020 -24.020 -24.020 -24.020 -24.020 electronvolt
mo.energy: -15.499 electronvolt
energy: -9.089 -14.453 -24.020 -9.089 3.868 -24.020 -9.089 -4.498 electronvolt
mo.energy: -15.376 electronvolt
energy: -9.089 -14.453 -24.020 -9.089 3.868 -24.020 -4.498 9.585 electronvolt
mo.energy: -12.842 electronvolt
energy: -4.498 -9.089 -9.089 -4.498 -9.089 -9.089 -9.089 -9.089 -4.498 -4.498 -4.498 4.055 -9.089 4.055 electronvolt
mo.energy: -12.788 electronvolt
energy: -9.089 -9.089 -4.498 -9.089 -9.089 -9.089 -9.089 4.055 -4.498 -9.089 1.231 -4.498 -5.688 -4.498 1.231 -9.089 -4.498 -9.089 -5.688 -4.498 -4.498 electronvolt
mo.energy: -12.721 electronvolt
energy: -9.089 -9.089 -4.498 -4.498 4.055 -4.498 -4.498 1.231 4.055 electronvolt
mo.energy: -12.637 electronvolt
energy: -9.089 -9.089 -5.206 -4.498 -9.089 -9.089 2.716 -4.498 -9.089 -9.089 -9.089 -4.498 -4.498 electronvolt
mo.energy: -12.626 electronvolt
energy: -9.089 -9.089 -4.498 -9.089 -9.089 4.055 1.231 -5.688 -9.089 -4.498 -9.089 15.256 -4.498 -4.498 electronvolt
mo.energy: -12.553 electronvolt
energy: -9.089 -9.089 -9.089 -4.498 -4.498 -9.089 2.716 -9.089 -9.089 -5.206 -9.089 -4.498 -9.089 4.055 -9.089 -4.498 -9.089 electronvolt
mo.energy: -12.470 electronvolt
energy: -9.089 -4.498 -9.089 -9.089 -9.089 4.055 -9.089 -4.498 -9.089 -4.498 -9.089 -4.498 1.231 -9.089 -4.498 electronvolt
mo.energy: -12.383 electronvolt
energy: -9.089 -5.206 -9.089 -9.089 -4.498 -4.498 -9.089 2.716 -9.089 -9.089 -4.498 -4.498 -9.089 -9.089 -9.089 -9.089 -24.020 -4.498 -9.089 electronvolt
mo.energy: -12.382 electronvolt
energy: -9.089 -9.089 -9.089 -9.089 -4.498 2.716 4.055 -9.089 -9.089 -4.498 1.231 -5.688 -24.020 -4.498 -5.206 -9.089 -9.089 electronvolt
mo.energy: -12.173 electronvolt
energy: -9.089 -4.498 -9.089 -9.089 -5.206 -9.089 -9.089 2.716 -4.498 -24.020 -9.089 -9.089 -9.089 -4.498 electronvolt
mo.energy: -12.143 electronvolt
energy: -9.089 -9.089 -4.498 -9.089 -4.498 4.055 -9.089 -4.498 4.055 electronvolt
mo.energy: -12.104 electronvolt
energy: -9.089 -9.089 -9.089 -9.089 -9.089 -4.498 -4.498 -9.089 -4.498 -4.498 -4.498 -9.089 -9.089 -4.498 -4.498 -9.089 -4.498 -9.089 -9.089 1.231 -9.089 4.055 4.055 electronvolt
mo.energy: -11.914 electronvolt
energy: -9.089 -9.089 -4.498 -9.089 -9.089 -4.498 -9.089 -9.089 -4.498 -9.089 4.055 -4.498 -4.498 -24.020 electronvolt
mo.energy: -11.826 electronvolt
energy: -9.089 -9.089 -9.089 -4.498 -9.089 -9.089 -4.498 -9.089 4.055 -9.089 -4.498 -24.020 electronvolt
mo.energy: -11.614 electronvolt
energy: -9.089 -4.498 -9.089 -9.089 -9.089 -4.498 -9.089 -4.498 -9.089 -4.498 -4.498 4.055 -4.498 -9.089 -9.089 -9.089 -4.498 4.055 electronvolt
mo.energy: -11.332 electronvolt
energy: -9.089 -9.089 -9.089 -4.498 -4.498 -9.089 -9.089 -9.089 -4.498 -9.089 -4.498 -9.089 -9.089 -9.089 -9.089 -9.089 -9.089 -9.089 -9.089 -9.089 -4.498 6.242 -9.089 electronvolt
mo.energy: -11.312 electronvolt
energy: -9.089 -9.089 -9.089 -4.498 -9.089 -4.498 -4.498 -4.498 -9.089 -9.089 -9.089 -9.089 -9.089 -9.089 -4.498 -9.089 -9.089 electronvolt
mo.energy: -11.279 electronvolt
energy: -9.089 -9.089 -4.498 -4.498 -4.498 -9.089 -9.089 -9.089 -9.089 -9.089 -4.498 -9.089 4.055 -9.089 electronvolt
mo.energy: -11.270 electronvolt
energy: -9.089 -9.089 -4.498 -4.498 -9.089 -4.498 -4.498 -9.089 -9.089 -9.089 -4.498 -9.089 -4.498 4.055 4.055 -4.498 electronvolt
mo.energy: -11.224 electronvolt
energy: -9.089 -4.498 -9.089 -9.089 -9.089 -9.089 -4.498 -9.089 -9.089 -9.089 -9.089 -9.089 -4.498 -4.498 -4.498 -9.089 4.055 -9.089 -4.498 -4.498 -9.089 -4.498 -9.089 -4.498 -4.498 -9.089 -4.498 electronvolt
mo.energy: -11.077 electronvolt
energy: -9.089 -9.089 -9.089 -9.089 -9.089 -4.498 -9.089 -4.498 -9.089 -9.089 -4.498 -4.498 -9.089 -4.498 -9.089 -4.498 -9.089 -9.089 -9.089 -9.089 -9.089 -9.089 electronvolt
mo.energy: -10.959 electronvolt
energy: -9.089 -9.089 -4.498 -4.498 -4.498 -24.020 4.055 -9.089 4.055 electronvolt
mo.energy: -10.940 electronvolt
energy: -9.089 -9.089 -4.498 -9.089 -9.089 -9.089 -4.498 -9.089 -9.089 -9.089 -4.498 -4.498 -9.089 -9.089 -9.089 -4.498 -9.089 -9.089 -9.089 6.242 -9.089 -4.498 -0.500 -24.020 -9.089 -9.089 electronvolt
mo.energy: -10.854 electronvolt
energy: -9.089 -9.089 -9.089 -9.089 -4.498 -9.089 -4.498 -9.089 -4.498 -9.089 -9.089 -9.089 -9.089 -9.089 -9.089 -4.498 -4.498 -9.089 -4.498 -9.089 -4.498 -9.089 6.242 -4.498 electronvolt
mo.energy: -10.780 electronvolt
energy: -9.089 -9.089 -9.089 -4.498 -4.498 -4.498 -4.498 -9.089 -9.089 -9.089 -9.089 -9.089 -4.498 -9.089 -4.498 -9.089 -4.498 -9.089 -9.089 4.055 -9.089 electronvolt
mo.energy: -10.751 electronvolt
energy: -9.089 -9.089 -9.089 -9.089 -4.498 -9.089 -9.089 -9.089 -4.498 -9.089 -9.089 -9.089 4.055 -9.089 -4.498 -4.498 electronvolt
mo.energy: -10.696 electronvolt
energy: -4.498 -9.089 -9.089 -9.089 -4.498 -9.089 -9.089 -9.089 -9.089 -4.498 -9.089 -9.089 -9.089 4.055 -4.498 -9.089 electronvolt
mo.energy: -10.673 electronvolt
energy: -4.498 -9.089 -9.089 -9.089 -9.089 -9.089 -4.498 -9.089 -9.089 -9.089 -4.498 -4.498 4.055 -9.089 electronvolt
mo.energy: -10.535 electronvolt
energy: -9.089 -9.089 -9.089 -9.089 -9.089 -4.498 -4.498 -9.089 -4.498 -9.089 -9.089 -4.498 -4.498 -4.498 -9.089 -4.498 -4.498 -9.089 electronvolt
mo.energy: -10.526 electronvolt
energy: -4.498 -9.089 -9.089 -9.089 -9.089 -4.498 -4.498 -4.498 -9.089 -9.089 -9.089 -9.089 -9.089 -9.089 -9.089 -9.089 -4.498 -4.498 -9.089 -9.089 -9.089 -4.498 -4.498 -9.089 electronvolt
mo.energy: -10.468 electronvolt
energy: -9.089 -4.498 -9.089 -9.089 -9.089 -9.089 -9.089 -9.089 -4.498 -9.089 -9.089 -4.498 -4.498 -4.498 -4.498 -4.498 -4.498 -9.089 electronvolt
mo.energy: -10.407 electronvolt
energy: -9.089 -9.089 -4.498 -9.089 -4.498 -9.089 -4.498 -9.089 -9.089 -9.089 -9.089 -9.089 -4.498 -4.498 -9.089 -4.498 -24.020 electronvolt
mo.energy: -10.401 electronvolt
energy: -9.089 -4.498 -9.089 -9.089 -9.089 -9.089 -4.498 -9.089 -9.089 -9.089 -9.089 -4.498 -4.498 -9.089 -9.089 -4.498 -4.498 -9.089 -9.089 -9.089 -4.498 -9.089 electronvolt
mo.energy: -10.376 electronvolt
energy: -4.498 -9.089 -9.089 -9.089 -9.089 -4.498 -9.089 -9.089 -9.089 -9.089 -9.089 -9.089 -24.020 electronvolt
mo.energy: -10.236 electronvolt
energy: -9.089 -9.089 -9.089 -9.089 -9.089 -4.498 -4.498 -4.498 -9.089 -9.089 -9.089 -4.498 -9.089 -9.089 -4.498 2.716 -4.498 -9.089 -9.089 -4.498 electronvolt
mo.energy: -10.207 electronvolt
energy: -9.089 -9.089 -9.089 -9.089 -9.089 -4.498 -4.498 -4.498 -9.089 -4.498 -9.089 -4.498 -9.089 -9.089 -9.089 -9.089 -9.089 -9.089 -4.498 -9.089 electronvolt
mo.energy: -10.190 electronvolt
energy: -9.089 -9.089 -9.089 -9.089 -9.089 -4.498 -9.089 -9.089 -9.089 -4.498 -4.498 -4.498 -9.089 -9.089 -4.498 -9.089 -9.089 -9.089 -4.498 -4.498 -9.089 -9.089 -9.089 -4.498 -4.498 -9.089 -4.498 -9.089 -9.089 -9.089 -4.498 -9.089 electronvolt
mo.energy: -10.153 electronvolt
energy: -9.089 -9.089 -9.089 -9.089 -4.498 -9.089 -4.498 -4.498 -9.089 -4.498 -24.020 -9.089 -9.089 -4.498 4.055 -9.089 4.055 -9.089 -9.089 electronvolt
mo.energy: -10.091 electronvolt
energy: -4.498 -9.089 -9.089 -9.089 -9.089 -9.089 -4.498 -9.089 -9.089 -9.089 -5.206 -9.089 -9.089 -9.089 -4.498 electronvolt
mo.energy: -10.082 electronvolt
energy: -9.089 -9.089 -9.089 -9.089 -9.089 -4.498 -9.089 -4.498 -9.089 -4.498 -4.498 -9.089 -9.089 -9.089 -9.089 -9.089 -9.089 -9.089 -9.089 -9.089 -9.089 -4.498 electronvolt
mo.energy: -10.081 electronvolt
energy: -9.089 -4.498 -9.089 -9.089 -9.089 -9.089 -9.089 -9.089 -9.089 -9.089 -4.498 -9.089 -9.089 -4.498 -9.089 -9.089 electronvolt
mo.energy: -10.051 electronvolt
energy: -9.089 -9.089 -9.089 -9.089 -4.498 -9.089 -9.089 -9.089 -4.498 -24.020 -9.089 -9.089 -4.498 4.055 -5.688 -4.498 1.231 -4.498 electronvolt
mo.energy: -10.031 electronvolt
energy: -9.089 -9.089 -9.089 -9.089 -4.498 -9.089 -9.089 -9.089 -4.498 -4.498 -9.089 -9.089 -9.089 -9.089 -4.498 -4.498 -9.089 -9.089 -9.089 -4.498 -4.498 -9.089 -4.498 electronvolt
mo.energy: -9.880 electronvolt
energy: -9.089 -9.089 -9.089 -9.089 -4.498 -9.089 -9.089 -9.089 -9.089 -4.498 -4.498 -9.089 -9.089 -9.089 -4.498 -4.498 -9.089 -9.089 -9.089 -9.089 -9.089 -4.498 -4.498 -4.498 -4.498 -9.089 -9.089 -9.089 electronvolt
mo.energy: -9.859 electronvolt
energy: -9.089 -9.089 -9.089 -9.089 -9.089 -9.089 -9.089 -4.498 -0.500 -4.498 -9.089 electronvolt
mo.energy: -9.783 electronvolt
energy: -9.089 -4.498 -9.089 -9.089 -9.089 -4.498 -9.089 -9.089 -9.089 -4.498 -9.089 -9.089 -9.089 -0.500 -4.498 -4.498 -9.089 -4.498 -14.453 electronvolt
mo.energy: -9.776 electronvolt
energy: -9.089 -9.089 -9.089 -9.089 -4.498 -4.498 -4.498 -9.089 -9.089 -4.498 -9.089 -9.089 -24.020 electronvolt
mo.energy: -9.769 electronvolt
energy: -9.089 -9.089 -9.089 -9.089 -9.089 -4.498 -4.498 -9.089 -9.089 -9.089 -9.089 -9.089 -9.089 -9.089 -4.498 -9.089 -9.089 -4.498 -9.089 -9.089 -4.498 -4.498 -9.089 -4.498 -4.498 -4.498 -4.498 -9.089 electronvolt
mo.energy: -9.616 electronvolt
energy: -9.089 -9.089 -9.089 -9.089 -9.089 -9.089 -9.089 -9.089 -4.498 -9.089 -4.498 -9.089 -9.089 -9.089 -9.089 -9.089 -9.089 -4.498 -9.089 -9.089 -0.500 electronvolt
mo.energy: -9.613 electronvolt
energy: -9.089 -9.089 -9.089 -9.089 -4.498 -9.089 -4.498 -9.089 -4.498 -9.089 -4.498 -9.089 -14.453 -24.020 -24.020 -9.089 -4.498 -4.498 -9.089 electronvolt
mo.energy: -9.515 electronvolt
energy: -9.089 -9.089 -9.089 -9.089 -9.089 -4.498 -9.089 -4.498 -0.500 -9.089 -9.089 -9.089 -4.498 4.055 -4.498 20.662 electronvolt
mo.energy: -9.506 electronvolt
energy: -9.089 -9.089 -9.089 -4.498 -9.089 -9.089 -9.089 -9.089 -9.089 -9.089 -4.498 -4.498 -9.089 -9.089 -9.089 -4.498 -9.089 -9.089 electronvolt
mo.energy: -9.465 electronvolt
energy: -9.089 -9.089 -9.089 -9.089 -9.089 -9.089 -9.089 -4.498 -4.498 -9.089 -0.500 4.055 -4.498 20.662 -24.020 electronvolt
mo.energy: -9.415 electronvolt
energy: -9.089 -4.498 -9.089 -9.089 -9.089 -9.089 -9.089 -4.498 -9.089 -9.089 -4.498 -9.089 -9.089 -4.498 -9.089 -4.498 electronvolt
mo.energy: -9.412 electronvolt
energy: -9.089 -9.089 -4.498 -9.089 -9.089 -4.498 -9.089 -4.498 -9.089 -9.089 -9.089 -4.498 -9.089 -9.089 -9.089 -4.498 electronvolt
mo.energy: -9.384 electronvolt
energy: -9.089 -4.498 -9.089 -9.089 -9.089 -9.089 -4.498 -4.498 -9.089 -4.498 -9.089 -9.089 -9.089 -9.089 -9.089 -4.498 -4.498 -4.498 -9.089 -9.089 -9.089 -9.089 -9.089 electronvolt
mo.energy: -9.381 electronvolt
energy: -9.089 -9.089 -9.089 -4.498 -9.089 -9.089 -9.089 -9.089 -9.089 -9.089 -9.089 -9.089 -9.089 -4.498 -9.089 -9.089 -4.498 -9.089 -9.089 -9.089 -9.089 -4.498 electronvolt
mo.energy: -9.339 electronvolt
energy: -9.089 -4.498 -9.089 -9.089 -9.089 -4.498 -9.089 -9.089 -9.089 -9.089 -4.498 -9.089 -9.089 -4.498 -9.089 -9.089 -9.089 -9.089 -4.498 -9.089 electronvolt
mo.energy: -9.330 electronvolt
energy: -9.089 -9.089 -9.089 -4.498 -9.089 -4.498 -4.498 -9.089 -9.089 -24.020 -4.498 -4.498 -9.089 -9.089 -24.020 4.055 -24.020 electronvolt
mo.energy: -9.275 electronvolt
energy: -9.089 -9.089 -4.498 -9.089 -4.498 -9.089 -4.498 -9.089 -9.089 -9.089 -0.500 -9.089 -9.089 electronvolt
mo.energy: -9.256 electronvolt
energy: -9.089 -9.089 -9.089 -9.089 -9.089 -9.089 -9.089 -4.498 -9.089 -4.498 -4.498 -4.498 -9.089 -9.089 -9.089 -9.089 -4.498 -4.498 -9.089 -9.089 electronvolt
mo.energy: -9.237 electronvolt
energy: -9.089 -9.089 -9.089 -9.089 -9.089 -9.089 -9.089 -9.089 -4.498 -4.498 -5.206 -24.020 -4.498 -4.498 -9.089 -24.020 -9.089 -9.089 electronvolt
mo.energy: -9.158 electronvolt
energy: -9.089 -9.089 -9.089 -9.089 -9.089 -4.498 -9.089 -9.089 -24.020 -5.206 -9.089 -9.089 -9.089 -4.498 4.055 -4.498 -4.498 -24.020 electronvolt
mo.energy: -9.134 electronvolt
energy: -9.089 -9.089 -9.089 -9.089 -4.498 -9.089 -9.089 -9.089 -4.498 -9.089 -4.498 -4.498 -9.089 -9.089 -9.089 -9.089 -24.020 -9.089 -4.498 -24.020 electronvolt
mo.energy: -9.099 electronvolt
energy: -9.089 -9.089 -4.498 -9.089 -9.089 -9.089 -9.089 -9.089 -9.089 -4.498 -9.089 -9.089 -9.089 -4.498 -9.089 -9.089 -9.089 electronvolt
mo.energy: -9.080 electronvolt
energy: -9.089 -9.089 -4.498 -9.089 -4.498 -9.089 -4.498 -9.089 -4.498 -9.089 -9.089 -4.498 -4.498 electronvolt
mo.energy: -9.079 electronvolt
energy: -9.089 -9.089 -9.089 -9.089 -9.089 -9.089 -9.089 -9.089 -4.498 -9.089 -4.498 -4.498 -24.020 2.716 -9.089 -4.498 -24.020 -24.020 -9.089 -9.089 electronvolt
mo.energy: -9.054 electronvolt
energy: -9.089 -4.498 -9.089 -9.089 -9.089 -9.089 -4.498 -4.498 4.055 electronvolt
mo.energy: -9.038 electronvolt
energy: -9.089 -9.089 -4.498 -9.089 -9.089 -4.498 -9.089 -0.500 electronvolt
mo.energy: -9.009 electronvolt
energy: -9.089 -9.089 -9.089 -9.089 -4.498 -4.498 -9.089 -9.089 -9.089 -4.498 -9.089 -9.089 -4.498 -4.498 -9.089 -9.089 -4.498 -9.089 electronvolt
mo.energy: -8.838 electronvolt
energy: -9.089 -9.089 -9.089 -9.089 -9.089 -9.089 -9.089 -9.089 -9.089 -9.089 -9.089 -9.089 -4.498 -9.089 -9.089 -9.089 -4.498 -9.089 -4.498 -0.500 -4.498 -9.089 electronvolt
mo.energy: -8.789 electronvolt
energy: -9.089 -9.089 -9.089 -9.089 -9.089 -9.089 -9.089 -9.089 -9.089 -9.089 -0.500 -0.500 20.662 electronvolt
mo.energy: -8.776 electronvolt
mo.energy: -8.704 electronvolt
energy: -9.089 -9.089 -9.089 -9.089 -9.089 -9.089 -9.089 -9.089 -9.089 -9.089 -9.089 -9.089 -9.089 -9.089 electronvolt
mo.energy: -8.666 electronvolt
energy: -9.089 -9.089 -9.089 -9.089 -4.498 -9.089 -4.498 -9.089 -9.089 -9.089 -0.500 -0.500 electronvolt
mo.energy: -8.593 electronvolt
energy: -9.089 -9.089 -9.089 -9.089 -9.089 -9.089 -9.089 -9.089 -9.089 -9.089 -9.089 -9.089 -9.089 -4.498 electronvolt
mo.energy: -8.527 electronvolt
energy: -9.089 -9.089 -9.089 -9.089 -9.089 -9.089 -9.089 -9.089 -9.089 -9.089 6.242 6.242 -9.089 electronvolt
mo.energy: -8.473 electronvolt
energy: -9.089 -9.089 -9.089 -9.089 -9.089 -9.089 -4.498 -9.089 -9.089 -9.089 -9.089 -9.089 -9.089 -4.498 -9.089 -9.089 -9.089 -9.089 -9.089 -9.089 -4.498 -9.089 -9.089 -4.498 -9.089 electronvolt
mo.energy: -8.464 electronvolt
energy: -9.089 -9.089 -9.089 -9.089 -9.089 -9.089 -9.089 -9.089 -9.089 -9.089 -9.089 -0.500 -9.089 electronvolt
mo.energy: -8.389 electronvolt
energy: -9.089 -9.089 -9.089 -9.089 -9.089 -4.498 -9.089 -9.089 -4.498 -9.089 -9.089 -9.089 -4.498 -9.089 -4.498 -9.089 -9.089 -9.089 electronvolt
mo.energy: -8.376 electronvolt
energy: -9.089 -9.089 -9.089 -9.089 -9.089 -9.089 -9.089 -9.089 -9.089 -9.089 -9.089 -9.089 -9.089 -0.500 2.716 electronvolt
mo.energy: -8.367 electronvolt
energy: -9.089 -9.089 -9.089 -9.089 -9.089 -9.089 -9.089 -4.498 -9.089 -0.500 -9.089 -4.498 electronvolt
mo.energy: -8.356 electronvolt
energy: -9.089 -9.089 -9.089 -9.089 -9.089 -9.089 -9.089 6.242 -9.089 -9.089 -4.498 -9.089 -9.089 -9.089 electronvolt
mo.energy: -8.105 electronvolt
energy: -9.089 -9.089 -9.089 -9.089 -9.089 -9.089 -9.089 -9.089 -9.089 -9.089 -9.089 -9.089 -9.089 -9.089 -9.089 -9.089 -9.089 electronvolt
mo.energy: -8.073 electronvolt
energy: -9.089 -9.089 -9.089 -9.089 -9.089 -9.089 -9.089 -9.089 electronvolt
mo.energy: -8.040 electronvolt
energy: -9.089 -9.089 -9.089 -9.089 -9.089 -9.089 -9.089 -9.089 -9.089 -0.500 -9.089 electronvolt
mo.energy: -8.039 electronvolt
energy: -9.089 -9.089 -9.089 -9.089 -9.089 -9.089 -9.089 -9.089 -9.089 -9.089 -9.089 -0.500 -9.089 -9.089 electronvolt
mo.energy: -7.931 electronvolt
energy: -9.089 -9.089 -9.089 -9.089 -9.089 -9.089 -9.089 -9.089 -4.498 -9.089 -9.089 -9.089 -0.500 electronvolt
mo.energy: -7.879 electronvolt
energy: -9.089 -9.089 -9.089 -9.089 -9.089 -9.089 -9.089 -9.089 -9.089 -9.089 -9.089 electronvolt
mo.energy: -7.826 electronvolt
energy: -9.089 -9.089 -9.089 -9.089 -4.498 -9.089 -4.498 -9.089 -9.089 -4.498 -9.089 electronvolt
mo.energy: -7.819 electronvolt
energy: -9.089 -9.089 -9.089 -9.089 -9.089 -9.089 -9.089 -9.089 -9.089 -9.089 -9.089 -9.089 -9.089 -9.089 -9.089 -9.089 electronvolt
mo.energy: -7.815 electronvolt
mo.energy: -7.813 electronvolt
energy: -9.089 -9.089 -4.498 -9.089 -9.089 -9.089 -9.089 -9.089 -9.089 -4.498 -9.089 -9.089 electronvolt
mo.energy: -7.699 electronvolt
mo.energy: -7.612 electronvolt
energy: -9.089 -9.089 -9.089 -9.089 -9.089 -9.089 -9.089 -9.089 -9.089 -9.089 -9.089 -9.089 -9.089 -9.089 -9.089 -4.498 -9.089 -9.089 -9.089 electronvolt
mo.energy: -7.538 electronvolt
mo.energy: -7.482 electronvolt
energy: -9.089 -9.089 -9.089 -9.089 -9.089 -9.089 -9.089 -9.089 -9.089 -9.089 -9.089 -0.500 electronvolt
mo.energy: -7.426 electronvolt
mo.energy: -7.400 electronvolt
mo.energy: -7.387 electronvolt
energy: -9.089 -9.089 -9.089 -9.089 -9.089 -9.089 -9.089 -9.089 -9.089 -9.089 -9.089 -9.089 electronvolt
mo.energy: -7.385 electronvolt
energy: -9.089 -9.089 -9.089 -9.089 -9.089 -9.089 -9.089 -9.089 -9.089 -9.089 -9.089 -9.089 -9.089 -9.089 9.585 electronvolt
mo.energy: -7.362 electronvolt
energy: -9.089 -9.089 -9.089 -9.089 -9.089 -9.089 -9.089 -9.089 -9.089 -9.089 -9.089 -9.089 -9.089 -9.089 -9.089 -9.089 -9.089 -9.089 -9.089 -9.089 electronvolt
mo.energy: -7.347 electronvolt
energy: -9.089 -9.089 -9.089 -9.089 -9.089 -9.089 -9.089 -9.089 -9.089 -9.089 -9.089 -9.089 -9.089 -9.089 -9.089 electronvolt
mo.energy: -7.338 electronvolt
energy: -9.089 -9.089 -9.089 -9.089 -9.089 -9.089 -9.089 -9.089 -9.089 -9.089 -9.089 -9.089 -9.089 electronvolt
mo.energy: -7.290 electronvolt
mo.energy: -7.258 electronvolt
mo.energy: -7.249 electronvolt
energy: -9.089 -9.089 -9.089 -9.089 -9.089 -9.089 -9.089 -9.089 -9.089 9.585 electronvolt
mo.energy: -7.248 electronvolt
energy: -9.089 -9.089 -9.089 -9.089 -9.089 -9.089 -9.089 -9.089 -9.089 -9.089 -9.089 -9.089 -9.089 6.242 electronvolt
mo.energy: -7.234 electronvolt
energy: -9.089 -9.089 -9.089 -9.089 -9.089 -9.089 -9.089 -9.089 -9.089 -9.089 -9.089 -9.089 -9.089 -9.089 -9.089 -9.089 -9.089 -9.089 electronvolt
mo.energy: -7.192 electronvolt
mo.energy: -7.152 electronvolt
energy: -9.089 -9.089 -9.089 -9.089 -9.089 -9.089 -9.089 electronvolt
mo.energy: -7.133 electronvolt
mo.energy: -7.102 electronvolt
mo.energy: -7.074 electronvolt
energy: -9.089 -9.089 -9.089 -9.089 -9.089 -9.089 -9.089 -9.089 9.585 electronvolt
mo.energy: -7.057 electronvolt
mo.energy: -7.038 electronvolt
mo.energy: -6.961 electronvolt
mo.energy: -6.949 electronvolt
energy: -9.089 -9.089 -9.089 -9.089 -9.089 -9.089 -9.089 -9.089 -9.089 -9.089 -9.089 -9.089 -9.089 -9.089 -9.089 6.242 -9.089 electronvolt
mo.energy: -6.900 electronvolt
mo.energy: -6.774 electronvolt
energy: -9.089 -9.089 -9.089 -9.089 -9.089 -9.089 -9.089 -9.089 -9.089 electronvolt
mo.energy: -6.724 electronvolt
mo.energy: -4.407 electronvolt
energy: -4.498 -9.089 -4.498 -4.498 -9.089 -4.498 -9.089 4.055 -4.498 9.585 -9.089 electronvolt
mo.energy: -4.228 electronvolt
energy: -4.498 -4.498 -9.089 -4.498 -9.089 -4.498 -4.498 -4.498 -4.498 -9.089 -9.089 -4.498 4.055 electronvolt
mo.energy: -3.691 electronvolt
energy: -4.498 -4.498 -4.498 -4.498 -9.089 -9.089 -9.089 -9.089 -9.089 -9.089 -4.498 -9.089 4.055 electronvolt
mo.energy: -3.327 electronvolt
energy: -4.498 -4.498 -9.089 -4.498 -4.498 -9.089 -9.089 -9.089 -4.498 -9.089 -9.089 -4.498 -9.089 -9.089 4.055 -9.089 electronvolt
mo.energy: -3.003 electronvolt
energy: -4.498 -4.498 -9.089 -9.089 -4.498 -4.498 -9.089 -9.089 -9.089 -9.089 -9.089 9.585 electronvolt
mo.energy: -2.995 electronvolt
energy: -4.498 -9.089 -4.498 -14.453 -9.089 -9.089 -4.498 -4.498 -9.089 -4.498 4.055 -9.089 -9.089 -4.498 -9.089 9.585 electronvolt
mo.energy: -2.982 electronvolt
energy: -4.498 -9.089 -4.498 -4.498 -9.089 -4.498 -4.498 -9.089 -4.498 -9.089 -4.498 -9.089 electronvolt
mo.energy: -2.965 electronvolt
energy: -4.498 -4.498 -4.498 -9.089 -4.498 -9.089 -4.498 -9.089 -9.089 -9.089 -4.498 -4.498 -9.089 -9.089 -9.089 -4.498 -4.498 electronvolt
mo.energy: -2.902 electronvolt
energy: -4.498 -4.498 -9.089 -9.089 -4.498 -4.498 -4.498 -4.498 -9.089 -9.089 -9.089 -9.089 -4.498 -9.089 -4.498 electronvolt
mo.energy: -2.866 electronvolt
energy: -4.498 -9.089 -9.089 -4.498 4.055 -9.089 -9.089 9.585 -4.498 electronvolt
energy: -4.498 -9.089 -4.498 -4.498 -9.089 -9.089 4.055 -9.089 -9.089 -4.498 -4.498 -9.089 -9.089 electronvolt
mo.energy: -2.787 electronvolt
energy: -4.498 -4.498 -9.089 -9.089 -4.498 -4.498 -9.089 -9.089 -4.498 -4.498 4.055 -9.089 electronvolt
mo.energy: -2.687 electronvolt
energy: -4.498 -4.498 -4.498 -4.498 -9.089 -4.498 -9.089 -9.089 -4.498 -9.089 -9.089 -4.498 -4.498 -4.498 -4.498 -9.089 -9.089 -4.498 4.055 electronvolt
mo.energy: -2.683 electronvolt
energy: -4.498 -4.498 -4.498 -9.089 -9.089 -9.089 -9.089 -4.498 -4.498 -9.089 -4.498 -4.498 -9.089 -4.498 -9.089 -9.089 4.055 -4.498 electronvolt
mo.energy: -2.641 electronvolt
energy: -4.498 -9.089 -4.498 -4.498 -4.498 -9.089 -9.089 -9.089 4.055 -9.089 9.585 4.055 electronvolt
mo.energy: -2.628 electronvolt
energy: -4.498 -4.498 -9.089 -4.498 -4.498 -9.089 -4.498 -4.498 -9.089 -4.498 -9.089 -9.089 -9.089 -9.089 -9.089 -4.498 -9.089 -4.498 -9.089 -4.498 electronvolt
mo.energy: -2.606 electronvolt
energy: -4.498 -4.498 -4.498 -9.089 -4.498 -4.498 -9.089 -9.089 -9.089 -9.089 -9.089 4.055 4.055 4.055 electronvolt
mo.energy: -2.485 electronvolt
energy: -4.498 -4.498 -9.089 -9.089 -9.089 -4.498 -9.089 -4.498 -9.089 4.055 -9.089 -4.498 -4.498 -9.089 -4.498 electronvolt
mo.energy: -2.461 electronvolt
energy: -4.498 -9.089 -4.498 -4.498 -4.498 -4.498 -4.498 -9.089 -9.089 4.055 -4.498 -9.089 -9.089 -9.089 -9.089 -9.089 -9.089 -4.498 -9.089 -9.089 -4.498 -9.089 electronvolt
mo.energy: -2.397 electronvolt
energy: -14.453 -4.498 -9.089 -4.498 -4.498 -4.498 -9.089 -9.089 -4.498 -9.089 -9.089 -4.498 -9.089 -24.020 24.654 9.585 -9.089 -9.089 -9.089 3.868 -4.498 1.231 electronvolt
mo.energy: -2.253 electronvolt
energy: -4.498 -4.498 -9.089 -4.498 -4.498 -4.498 -9.089 -9.089 -9.089 -4.498 -9.089 -9.089 -9.089 4.055 -4.498 4.055 -4.498 -4.498 -9.089 electronvolt
mo.energy: -2.194 electronvolt
energy: -4.498 -14.453 -9.089 -4.498 -9.089 -9.089 -9.089 -4.498 -4.498 -9.089 -4.498 -9.089 4.055 -9.089 -24.020 9.585 -9.089 24.654 -9.089 -9.089 -9.089 -4.498 electronvolt
mo.energy: -2.161 electronvolt
energy: -14.453 -4.498 -9.089 -9.089 -4.498 -4.498 -9.089 -4.498 -9.089 9.585 -9.089 -9.089 -4.498 -24.020 24.654 -9.089 4.055 1.231 4.055 -9.089 -9.089 -4.498 electronvolt
mo.energy: -2.099 electronvolt
energy: -4.498 -4.498 -4.498 -4.498 -9.089 -9.089 -9.089 -4.498 -9.089 -9.089 -4.498 -9.089 4.055 -9.089 4.055 electronvolt
mo.energy: -2.091 electronvolt
energy: -4.498 -4.498 -9.089 -9.089 -4.498 -4.498 -9.089 4.055 -9.089 -4.498 electronvolt
mo.energy: -1.998 electronvolt
energy: -4.498 -4.498 -4.498 -4.498 -9.089 -9.089 -9.089 -9.089 -9.089 -9.089 4.055 -9.089 -4.498 -4.498 4.055 electronvolt
mo.energy: -1.738 electronvolt
energy: -4.498 -4.498 -14.453 -4.498 -9.089 -4.498 -4.498 -4.498 -4.498 -9.089 -9.089 -9.089 -9.089 -9.089 -9.089 -9.089 4.055 -4.498 -9.089 -9.089 9.585 4.055 -9.089 electronvolt
mo.energy: -1.674 electronvolt
energy: -4.498 -4.498 -9.089 -9.089 -4.498 -4.498 -9.089 -4.498 -4.498 -9.089 -9.089 -9.089 -9.089 -9.089 4.055 -4.498 4.055 -9.089 -9.089 -4.498 electronvolt
mo.energy: -1.672 electronvolt
energy: -4.498 -4.498 -9.089 -9.089 -9.089 -4.498 -9.089 -9.089 -4.498 4.055 4.055 -9.089 electronvolt
mo.energy: -1.585 electronvolt
energy: -4.498 -4.498 -4.498 -4.498 -4.498 -9.089 -9.089 -5.206 -4.498 -9.089 -9.089 -4.498 -9.089 -9.089 -9.089 -9.089 4.055 -9.089 -9.089 -9.089 -24.020 4.055 4.055 -9.089 -4.498 electronvolt
mo.energy: -1.577 electronvolt
energy: -4.498 -4.498 -4.498 -4.498 -9.089 -9.089 -4.498 -9.089 -9.089 4.055 -4.498 -9.089 -4.498 -9.089 -9.089 -9.089 -9.089 4.055 -9.089 -9.089 electronvolt
mo.energy: -1.545 electronvolt
energy: -4.498 -4.498 -4.498 -4.498 -9.089 -9.089 -4.498 -9.089 -9.089 -9.089 -9.089 -9.089 4.055 -9.089 -9.089 4.055 -9.089 -5.206 4.055 electronvolt
mo.energy: -1.529 electronvolt
energy: -4.498 -4.498 -9.089 -4.498 -4.498 -4.498 -9.089 -9.089 -4.498 -9.089 -9.089 -9.089 -9.089 4.055 -9.089 -4.498 -9.089 -9.089 -4.498 -4.498 -4.498 -9.089 -4.498 electronvolt
mo.energy: -1.507 electronvolt
energy: -4.498 -4.498 -9.089 -9.089 -9.089 -4.498 -4.498 -4.498 -9.089 4.055 4.055 -9.089 4.055 -9.089 -4.498 -4.498 electronvolt
mo.energy: -1.384 electronvolt
energy: -4.498 -4.498 -14.453 -4.498 -4.498 -9.089 -9.089 -9.089 -4.498 -9.089 -9.089 -9.089 -9.089 -5.688 -9.089 -9.089 4.055 -9.089 4.055 9.585 electronvolt
mo.energy: -1.316 electronvolt
energy: -4.498 -4.498 -9.089 -4.498 -9.089 -9.089 -4.498 -4.498 -9.089 -9.089 -4.498 4.055 4.055 -9.089 -9.089 -4.498 -9.089 electronvolt
mo.energy: -1.027 electronvolt
energy: -4.498 -4.498 -4.498 -14.453 -9.089 -9.089 -9.089 -9.089 -9.089 -4.498 -9.089 -9.089 1.231 3.868 -5.688 -9.089 4.055 -9.089 -9.089 9.585 -9.089 4.055 -9.089 4.055 24.654 -4.498 -9.089 electronvolt
mo.energy: -0.938 electronvolt
energy: -14.453 -4.498 -9.089 -4.498 9.585 -9.089 -9.089 -9.089 -9.089 -9.089 -5.688 -4.498 -4.498 -9.089 24.654 1.231 -4.498 -24.020 -9.089 9.585 electronvolt
mo.energy: -0.389 electronvolt
energy: -4.498 -4.498 -4.498 -4.498 -9.089 -9.089 -9.089 -5.688 -24.020 4.055 -9.089 4.055 -9.089 -24.020 -9.089 -9.089 -0.500 -24.020 -9.089 -24.020 electronvolt
mo.energy: -0.262 electronvolt
energy: -4.498 -4.498 -4.498 -4.498 -4.498 -24.020 -4.498 -4.498 -24.020 -9.089 -9.089 -9.089 -4.498 -9.089 -9.089 -9.089 4.055 -5.688 -24.020 -9.089 -4.498 -5.206 -0.500 24.654 electronvolt
mo.energy: -0.203 electronvolt
energy: -4.498 -4.498 -4.498 -4.498 -9.089 -9.089 -9.089 -5.688 -24.020 -0.500 4.055 -9.089 -4.498 -24.020 -9.089 24.654 -9.089 -9.089 -5.206 -0.500 -9.089 electronvolt
mo.energy: -0.049 electronvolt
energy: 1.231 1.231 -5.688 -5.688 -4.498 -4.498 -0.500 -0.500 -0.500 -4.498 -9.089 3.868 15.256 -9.089 24.654 -9.089 -24.020 electronvolt
mo.energy: 0.209 electronvolt
energy: 1.231 -5.688 1.231 -4.498 2.716 -9.089 -0.500 -9.089 -5.688 -0.500 -0.500 9.585 -4.498 -9.089 -24.020 24.654 -4.498 -24.020 electronvolt
mo.energy: 0.253 electronvolt
energy: -4.498 1.231 -5.688 -4.498 -4.498 1.231 -5.688 -9.089 1.231 2.716 -4.498 -0.500 -4.498 -9.089 -9.089 -4.498 -24.020 -24.020 9.585 -9.089 -9.089 24.654 electronvolt
mo.energy: 0.270 electronvolt
energy: -4.498 -4.498 -4.498 -4.498 -9.089 -4.498 -5.206 -5.688 -0.500 -4.498 -24.020 -9.089 -9.089 -0.500 -9.089 -9.089 -24.020 -9.089 -9.089 24.654 -24.020 -9.089 electronvolt
mo.energy: 0.292 electronvolt
energy: -5.206 1.231 -5.688 -4.498 -9.089 -4.498 6.242 9.585 -9.089 -9.089 -4.498 -24.020 -5.688 -4.498 24.654 -4.498 24.654 -9.089 -4.498 -9.089 electronvolt
mo.energy: 0.323 electronvolt
energy: 1.231 -5.688 1.231 -4.498 2.716 1.231 -5.688 -4.498 -5.688 -5.206 -4.498 -4.498 -9.089 -0.500 24.654 -9.089 -4.498 -9.089 4.055 -24.020 electronvolt
mo.energy: 0.396 electronvolt
energy: -4.498 -4.498 -4.498 -9.089 -4.498 -24.020 -9.089 -24.020 -5.688 -0.500 4.055 -9.089 -9.089 -9.089 24.654 -9.089 4.055 24.654 -4.498 electronvolt
mo.energy: 0.547 electronvolt
energy: 1.231 -4.498 -5.688 -9.089 -4.498 -14.453 -4.498 3.868 -9.089 -9.089 -9.089 -4.498 -9.089 -5.688 9.585 24.654 -0.500 9.585 -0.500 -24.020 -24.020 -24.020 -4.498 24.654 1.231 electronvolt
mo.energy: 0.592 electronvolt
energy: -4.498 -4.498 -5.688 -4.498 1.231 -9.089 -9.089 -0.500 1.231 -5.688 -4.498 -9.089 -4.498 -5.206 -4.498 -24.020 -4.498 -24.020 9.585 -9.089 -9.089 -9.089 -4.498 -9.089 electronvolt
mo.energy: 0.672 electronvolt
energy: -5.206 -4.498 -5.688 -5.688 1.231 -4.498 -9.089 1.231 -9.089 -4.498 -24.020 -4.498 -0.500 -5.688 -9.089 -4.498 -4.498 24.654 6.242 -4.498 -4.498 -4.498 -9.089 -0.500 -9.089 -9.089 electronvolt
mo.energy: 0.704 electronvolt
energy: 1.231 -4.498 -14.453 -9.089 3.868 -4.498 -9.089 9.585 -9.089 -5.688 -4.498 -4.498 24.654 -4.498 9.585 -9.089 -24.020 -4.498 4.055 electronvolt
mo.energy: 0.752 electronvolt
energy: 1.231 1.231 -5.688 -5.688 1.231 -4.498 -5.688 2.716 -0.500 -4.498 -4.498 -5.206 -4.498 -9.089 -0.500 -4.498 -0.500 24.654 electronvolt
mo.energy: 0.798 electronvolt
energy: 1.231 -4.498 -5.688 -5.688 1.231 -4.498 -4.498 -9.089 -4.498 -0.500 -9.089 -9.089 -4.498 1.231 -9.089 4.055 24.654 -0.500 -4.498 -4.498 -0.500 -9.089 -4.498 electronvolt
mo.energy: 0.984 electronvolt
energy: 1.231 -5.206 -5.688 1.231 -5.688 -4.498 -4.498 -0.500 -9.089 -9.089 -9.089 2.716 -0.500 6.242 9.585 4.055 9.585 4.055 -24.020 -9.089 electronvolt
mo.energy: 1.034 electronvolt
energy: -4.498 -5.206 -5.688 -5.688 -5.688 1.231 -4.498 -9.089 -9.089 -9.089 6.242 1.231 1.231 -9.089 -4.498 -9.089 -0.500 -9.089 29.005 -4.498 -4.498 electronvolt
