program: AMS
programVersion: 2023.101
runtype: GEOMETRY OPTIMIZATION
runtype: FREQUENCIES
method: DFT
functional: Becke88 Perdew86
functional: VWN
spinMolecule: Restricted
epsl: 7.58000
solvent: Tetrahydrofuran angstrom
formula: C35H49NiO4P
InChI: InChI=1S/C32H49OP.3CO.Ni/c1-25(2)29-19-18-26(3)24-30(29)33-34(31(4,5)22-20-27-14-10-8-11-15-27)32(6,7)23-21-28-16-12-9-13-17-28;3*1-2;/h8-17,25-26,29-30H,18-24H2,1-7H3;;;;
90 atoms
P  -0.785138 -0.227604 0.480688
C  0.215746 0.563553 1.899182
C  0.009552 -0.156000 3.244280
C  -0.321210 2.001173 2.014842
H  0.124985 2.493133 2.888981
H  -0.083104 2.592708 1.123677
H  -1.407821 2.013052 2.154154
H  0.620941 -1.058522 3.330100
H  -1.037763 -0.438229 3.392271
H  0.291895 0.518837 4.063306
C  1.703581 0.580285 1.505097
H  2.073765 -0.450641 1.438359
H  1.816890 1.021193 0.504963
C  2.653383 1.338889 2.450250
H  2.557098 0.955080 3.474773
H  2.399890 2.406972 2.469834
C  4.066851 1.150254 1.961321
C  4.594465 1.979822 0.962591
C  4.845309 0.080001 2.422283
C  5.869743 1.752452 0.443823
C  6.120687 -0.153374 1.904206
C  6.637661 0.683981 0.913145
H  3.996422 2.811234 0.586642
H  4.444767 -0.578394 3.194886
H  6.264358 2.409558 -0.330987
H  6.712050 -0.990356 2.275173
H  7.633166 0.504227 0.508226
C  -0.037549 -1.913772 0.054262
C  0.352643 -2.717017 1.303462
C  -1.095507 -2.724496 -0.708368
H  -1.938532 -2.990597 -0.062100
H  -1.478529 -2.182085 -1.579472
H  -0.635957 -3.655138 -1.069542
H  -0.480339 -2.756055 2.015019
H  1.230105 -2.310529 1.815994
H  0.589241 -3.749911 1.013629
C  1.159454 -1.629483 -0.891595
H  0.764501 -1.403200 -1.891532
H  1.697301 -0.728116 -0.583074
C  2.206055 -2.750123 -1.009573
H  1.756504 -3.664530 -1.420481
H  2.596831 -2.998773 -0.013154
C  3.341814 -2.288679 -1.887429
C  3.433196 -2.688471 -3.226259
C  4.297413 -1.389764 -1.389388
C  4.454585 -2.207851 -4.049673
C  5.318264 -0.907910 -2.207768
C  5.400967 -1.315014 -3.542334
H  2.694551 -3.384302 -3.627467
H  4.244428 -1.059718 -0.349970
H  4.510873 -2.532197 -5.088918
H  6.049327 -0.212232 -1.798124
H  6.198920 -0.939000 -4.182312
O  -2.163170 -0.644770 1.280402
C  -3.484765 -0.163248 0.879423
C  -4.376402 -0.113415 2.123779
C  -5.808169 0.267071 1.703768
C  -6.377338 -0.654378 0.625043
C  -5.475219 -0.671765 -0.612580
C  -4.058167 -1.075411 -0.194833
H  -3.362881 0.850253 0.467824
H  -3.391993 -1.068876 -1.065767
H  -4.074421 -2.106360 0.194764
H  -4.400956 -1.142489 2.524185
H  -5.809210 1.298473 1.318228
H  -6.457907 0.265196 2.589633
H  -7.392144 -0.331127 0.349454
H  -5.432090 0.356924 -1.013063
C  -6.007175 -1.593521 -1.709639
H  -5.355463 -1.576546 -2.593862
H  -6.060006 -2.632004 -1.350181
H  -7.016136 -1.293911 -2.024504
C  -3.816982 0.800378 3.239119
H  -2.744928 0.572886 3.310653
C  -4.440272 0.466261 4.598645
C  -3.956478 2.296671 2.933313
H  -5.002917 2.623566 3.000067
H  -3.379045 2.888344 3.656131
H  -3.593049 2.553766 1.929479
H  -3.986252 1.072919 5.394077
H  -4.292073 -0.592323 4.852987
H  -5.520989 0.668264 4.606944
H  -6.464343 -1.682386 1.016738
Ni -1.008028 1.117655 -1.317096
C  0.639437 1.653771 -1.743184
O  1.693129 2.014015 -2.058269
C  -1.719997 0.190371 -2.662377
C  -2.039143 2.501155 -0.865119
O  -2.695634 3.420228 -0.607425
O  -2.174957 -0.359253 -3.575184
zeropoint: 0.003134 electronvolt
frequency: 24.38800050 26.16376037 cm-1
elementType: P C C C H H H H H H C H H C H H C C C C C C H H H H H C C C H H H H H H C H H C H H C C C C C C H H H H H O C C C C C C H H H H H H H H C H H H C H C C H H H H H H H Ni C O C C O O
mdcq: 0.83832555 -0.14447325 0.16856117 0.11599486 0.00825122 -0.07058382 -0.08228905 -0.04994799 -0.05161818 -0.03110470 0.13072689 -0.06083675 -0.08401180 0.17997403 -0.05447139 -0.04519675 -0.01433118 -0.05982982 -0.05492021 -0.05233543 -0.08234266 -0.08648951 0.05206553 0.03809506 0.05277226 0.06955226 0.08427315 -0.14180308 0.16269974 0.13211550 -0.05032138 -0.05682502 -0.01763752 -0.04432474 -0.02401763 -0.02972222 0.10497970 -0.04126954 -0.10740092 0.18669610 -0.06059505 -0.03478444 -0.01954217 -0.14098680 -0.02741843 -0.07478008 -0.05525540 -0.08161665 0.05904628 0.05863388 0.09716233 0.01257715 0.06765305 -0.55451101 0.24052844 0.09475575 0.12835692 0.13331998 0.11959257 0.13027949 -0.11211087 -0.09578049 -0.03169907 -0.05070563 -0.06135694 -0.05314281 -0.05576562 -0.07995556 0.16255196 -0.05346843 -0.06079719 -0.05589881 0.12004743 -0.07395932 0.18024149 0.18543393 -0.06925452 -0.05558998 -0.06403639 -0.06039702 -0.06375115 -0.06932837 -0.08287768 0.31594931 -0.04039323 -0.15486838 -0.02967538 -0.04102147 -0.15888161 -0.16890253
eener: -402.956101 electronvolt
kinener: 496.971253 electronvolt
coulombener: -146.457545 electronvolt
xcener: -475.190459 electronvolt
solvener: -0.148084 electronvolt
dispener: -6.289529 electronvolt
total: -534.070460 electronvolt
charge: 1.17571355 -0.27470614 0.57238393 0.57095336 -0.22569356 -0.21022028 -0.09179225 -0.18902165 -0.17613276 -0.21755795 0.38940272 -0.14771255 -0.15300044 0.26652274 -0.17718768 -0.17813591 0.06895657 0.22259954 0.19315132 0.15698810 0.17086242 0.14766911 -0.19900951 -0.19951375 -0.18352764 -0.18734621 -0.17956825 -0.27654306 0.56973935 0.59290343 -0.18875459 -0.19395112 -0.22263346 -0.20273185 -0.19049515 -0.21143800 0.38409102 -0.16075978 -0.07738519 0.24925775 -0.18161123 -0.17772619 0.08031039 0.19421972 0.23085073 0.15337760 0.18933797 0.15492920 -0.20295504 -0.19707867 -0.18592721 -0.18353330 -0.19026131 -0.67394115 0.58123002 0.16496412 0.35779530 0.34204515 0.18078153 0.39067141 -0.15383691 -0.13595050 -0.18418004 -0.14414664 -0.17234435 -0.18149586 -0.19339232 -0.14297663 0.49828583 -0.19829924 -0.18292714 -0.20945535 0.17043821 -0.01573018 0.50996387 0.53409697 -0.20659967 -0.21659414 -0.16439562 -0.21047149 -0.20603072 -0.19187117 -0.18552592 -0.33082319 0.38363791 -0.41789647 0.37390528 0.38143956 -0.42744346 -0.42323582
quadrupole: 5.35988979 5.04044882 -6.00718846 -2.75182550 1.23862086 -2.60806430
charge: 0
converged: GEOMETRY CONVERGED
charge: 1.1757 -0.2747 0.5724 0.5710 -0.2257 -0.2102 -0.0918 -0.1890 -0.1761 -0.2176 0.3894 -0.1477 -0.1530 0.2665 -0.1772 -0.1781 0.0690 0.2226 0.1932 0.1570 0.1709 0.1477 -0.1990 -0.1995 -0.1835 -0.1873 -0.1796 -0.2765 0.5697 0.5929 -0.1888 -0.1940 -0.2226 -0.2027 -0.1905 -0.2114 0.3841 -0.1608 -0.0774 0.2493 -0.1816 -0.1777 0.0803 0.1942 0.2309 0.1534 0.1893 0.1549 -0.2030 -0.1971 -0.1859 -0.1835 -0.1903 -0.6739 0.5812 0.1650 0.3578 0.3420 0.1808 0.3907 -0.1538 -0.1360 -0.1842 -0.1441 -0.1723 -0.1815 -0.1934 -0.1430 0.4983 -0.1983 -0.1829 -0.2095 0.1704 -0.0157 0.5100 0.5341 -0.2066 -0.2166 -0.1644 -0.2105 -0.2060 -0.1919 -0.1855 -0.3308 0.3836 -0.4179 0.3739 0.3814 -0.4274 -0.4232
