program: AMS
programVersion: 2023.101
runtype: GEOMETRY OPTIMIZATION
runtype: FREQUENCIES
method: DFT
functional: Becke88 Perdew86
functional: VWN
spinMolecule: Restricted
epsl: 7.58000
solvent: Tetrahydrofuran angstrom
formula: C25H43NiO3P
InChI: InChI=1S/C22H43P.3CO.Ni/c1-8-23(21(4,5)19-13-9-17(2)10-14-19)22(6,7)20-15-11-18(3)12-16-20;3*1-2;/h17-20H,8-16H2,1-7H3;;;;
73 atoms
C  0.995862 1.748700 -0.733101
C  1.993890 2.746381 -1.354150
C  3.078675 3.135059 -0.338880
H  2.485981 2.311775 -2.232536
H  1.462334 3.645400 -1.703038
C  2.515723 3.716711 0.968948
H  3.664460 2.232253 -0.098746
H  3.778290 3.849833 -0.798039
C  1.469287 2.748593 1.546579
H  3.346602 3.788985 1.689045
C  0.388813 2.382377 0.525713
H  1.976077 1.825823 1.871771
H  1.005215 3.185885 2.443312
H  -0.332708 1.697420 0.982832
H  -0.178087 3.282495 0.245867
H  1.602912 0.894493 -0.406651
C  1.951589 5.130231 0.777702
H  1.116269 5.148252 0.065113
H  1.581892 5.534543 1.730297
H  2.725632 5.811060 0.396990
C  -0.065145 1.204545 -1.747871
C  0.599923 0.891986 -3.098673
C  -1.154243 2.261190 -2.002494
H  -1.815207 2.407205 -1.142405
H  -0.675441 3.224596 -2.225365
H  -1.766685 1.994815 -2.870832
H  -0.073569 0.348839 -3.770596
H  1.519834 0.308220 -2.985478
H  0.861503 1.831559 -3.602463
P  -0.954723 -0.359424 -1.063334
C  1.611785 -1.668361 -0.714610
C  1.641469 -1.298876 0.773239
C  3.054354 -0.952492 1.250095
H  0.976943 -0.450408 0.966174
H  1.241499 -2.132936 1.366799
C  4.055766 -2.092253 1.002908
H  3.399489 -0.054106 0.711703
H  3.033185 -0.689022 2.318058
C  3.997942 -2.499670 -0.478929
H  5.066885 -1.705261 1.207117
C  2.580291 -2.844352 -0.955488
H  4.378205 -1.664371 -1.089924
H  4.667939 -3.353562 -0.660558
H  2.623449 -3.099301 -2.021054
H  2.217104 -3.740521 -0.430783
H  2.032628 -0.817834 -1.276715
C  3.821665 -3.281615 1.942734
H  4.567714 -4.069208 1.767838
H  3.897525 -2.968730 2.993281
H  2.829044 -3.729827 1.802923
C  0.180337 -1.915366 -1.286466
C  -0.533093 -3.046436 -0.525261
C  0.291533 -2.346661 -2.762914
H  0.694353 -3.366322 -2.807439
H  -0.678525 -2.374167 -3.267488
H  0.960384 -1.700301 -3.338531
H  0.045131 -3.975016 -0.621951
H  -1.528853 -3.242341 -0.943308
H  -0.655897 -2.819800 0.538103
C  -2.262241 -0.691204 -2.352925
H  -1.852045 -0.460827 -3.344985
H  -2.409195 -1.779223 -2.325218
C  -3.624090 -0.017346 -2.174028
H  -4.100392 -0.324342 -1.237288
H  -4.284126 -0.311286 -3.001395
H  -3.558816 1.074877 -2.169778
Ni -2.098625 -0.252790 0.951956
C  -3.013889 1.275030 0.929579
C  -3.186754 -1.663433 0.882461
C  -1.040979 -0.354618 2.382093
O  -3.908066 -2.570127 0.870183
O  -3.633433 2.254000 0.960335
O  -0.429495 -0.416941 3.364023
zeropoint: 0.004251 electronvolt
frequency: 26.83923523 41.73078851 cm-1
elementType: C C C H H C H H C H C H H H H H C H H H C C C H H H H H H P C C C H H C H H C H C H H H H H C H H H C C C H H H H H H C H H C H H H Ni C C C O O O
mdcq: 0.07312883 0.13896345 0.13505124 -0.05378840 -0.06269626 0.09859320 -0.07208260 -0.06026108 0.13329938 -0.06278863 0.12749670 -0.07369767 -0.05154065 -0.13338853 -0.06332763 -0.08371591 0.18530239 -0.07024625 -0.06681859 -0.06600879 -0.14417829 0.16379374 0.13330021 -0.05137903 -0.01852937 -0.03937164 -0.05618607 -0.03337347 -0.02967566 0.57177947 0.07406074 0.12705195 0.14137257 -0.11074064 -0.06027024 0.10816608 -0.07375842 -0.05206030 0.13778704 -0.06870876 0.14105254 -0.07211538 -0.06517121 -0.04915890 -0.05918892 -0.07361847 0.16997113 -0.05992895 -0.06184635 -0.07119112 -0.14290813 0.12154621 0.16821818 -0.03227214 -0.05702239 -0.04322279 -0.01080777 -0.04921553 -0.07466516 -0.21427179 0.04112189 0.05107545 0.15728815 -0.07939876 0.00489727 -0.05290395 0.34786072 -0.04587347 -0.03889482 -0.03133017 -0.17334500 -0.16430510 -0.17092942
eener: -298.504994 electronvolt
kinener: 386.885325 electronvolt
coulombener: -131.437799 electronvolt
xcener: -367.172818 electronvolt
solvener: -0.089662 electronvolt
dispener: -5.166685 electronvolt
total: -415.486631 electronvolt
charge: 0.21493019 0.35001434 0.33712651 -0.19621392 -0.19643989 0.14927972 -0.16188039 -0.19568486 0.34416721 -0.14412803 0.37308663 -0.15977439 -0.20352977 -0.10813803 -0.19801190 -0.01820901 0.51826435 -0.17133508 -0.20213423 -0.20396474 -0.27087947 0.58335853 0.56569703 -0.17092942 -0.21762325 -0.20942271 -0.20748522 -0.18968196 -0.21655961 1.14856329 0.21781325 0.36945913 0.35600486 -0.10072948 -0.17896974 0.14809822 -0.16740873 -0.19539180 0.32348045 -0.13369026 0.36024857 -0.18679333 -0.19352015 -0.18552829 -0.17788763 -0.12332755 0.52015077 -0.20637786 -0.19777729 -0.17620000 -0.25505144 0.56981544 0.58184432 -0.20802718 -0.19499141 -0.18456519 -0.22372267 -0.18574845 -0.20261972 0.11639029 -0.17057972 -0.16145447 0.49972593 -0.17872279 -0.22032681 -0.16224815 -0.29756354 0.38245641 0.38042158 0.37944832 -0.42417570 -0.42757178 -0.42684835
quadrupole: -6.90942359 -0.87657904 8.38737579 2.53737911 1.74202498 4.37204448
charge: 0
converged: GEOMETRY CONVERGED
charge: 0.2149 0.3500 0.3371 -0.1962 -0.1964 0.1493 -0.1619 -0.1957 0.3442 -0.1441 0.3731 -0.1598 -0.2035 -0.1081 -0.1980 -0.0182 0.5183 -0.1713 -0.2021 -0.2040 -0.2709 0.5834 0.5657 -0.1709 -0.2176 -0.2094 -0.2075 -0.1897 -0.2166 1.1486 0.2178 0.3695 0.3560 -0.1007 -0.1790 0.1481 -0.1674 -0.1954 0.3235 -0.1337 0.3602 -0.1868 -0.1935 -0.1855 -0.1779 -0.1233 0.5202 -0.2064 -0.1978 -0.1762 -0.2551 0.5698 0.5818 -0.2080 -0.1950 -0.1846 -0.2237 -0.1857 -0.2026 0.1164 -0.1706 -0.1615 0.4997 -0.1787 -0.2203 -0.1622 -0.2976 0.3825 0.3804 0.3794 -0.4242 -0.4276 -0.4268
