program: AMS
programVersion: 2023.101
runtype: GEOMETRY OPTIMIZATION
runtype: FREQUENCIES
method: DFT
functional: Becke88 Perdew86
functional: VWN
spinMolecule: Restricted
epsl: 7.58000
solvent: Tetrahydrofuran angstrom
formula: C27H49AuClO2P
InChI: InChI=1S/C27H49O2P.Au.ClH/c1-10-22(3)16-14-20-26(5,6)30(27(7,8)21-15-17-23(4)11-2)29-25-19-13-12-18-24(25)28-9;;/h12-13,18-19,22-23H,10-11,14-17,20-21H2,1-9H3;;1H/q;+1;/p-1
81 atoms
P  0.004370 0.962703 1.345309
C  0.204971 2.830554 1.373974
C  -0.201774 3.434416 2.729361
C  -0.760168 3.372514 0.301487
H  -1.801218 3.157656 0.564446
H  -0.629043 4.461988 0.236957
H  -0.568437 2.937748 -0.686396
H  0.509678 3.200550 3.525919
H  -1.198072 3.100303 3.037448
H  -0.229325 4.527294 2.615671
C  1.235806 0.056601 2.442007
C  1.449887 0.762956 3.787036
C  2.569011 -0.058316 1.683343
H  3.067172 0.910619 1.573197
H  3.238452 -0.716844 2.254609
H  2.437008 -0.491056 0.683895
H  2.078041 0.121312 4.421377
H  0.502273 0.930378 4.313248
H  1.967690 1.721239 3.674238
C  1.660660 3.235693 1.049244
H  2.326804 2.862380 1.841041
H  1.695759 4.334863 1.130885
C  2.201213 2.820096 -0.318407
H  2.071237 1.735182 -0.464585
H  1.602247 3.295182 -1.105838
C  0.680761 -1.361695 2.748510
H  -0.219163 -1.256363 3.367676
H  1.435643 -1.837936 3.396259
C  0.376127 -2.276495 1.567169
H  -0.302872 -1.757328 0.876593
H  1.291786 -2.476590 0.990218
C  3.678788 3.163422 -0.501479
H  3.799510 4.256696 -0.593040
H  4.231427 2.871226 0.407103
C  -0.271860 -3.596040 1.973923
H  0.409015 -4.153937 2.638073
H  -1.180555 -3.384924 2.562032
C  4.339958 2.474409 -1.706617
H  4.249568 1.384121 -1.548268
C  5.830037 2.827618 -1.758232
C  3.619062 2.806069 -3.023623
H  2.553883 2.555803 -2.917961
H  3.668204 3.896333 -3.187506
H  6.360383 2.266026 -2.537291
H  6.317597 2.607527 -0.798284
H  5.964851 3.900352 -1.965400
C  -0.656113 -4.490845 0.782245
H  0.261072 -4.683628 0.196044
C  -1.667096 -3.793786 -0.145219
C  -1.187406 -5.833964 1.294633
H  -2.124524 -5.686411 1.853452
H  -1.391758 -6.536317 0.476777
H  -0.464507 -6.310451 1.971512
H  -2.577851 -3.572073 0.433466
H  -1.265927 -2.819947 -0.459412
C  4.168902 2.070343 -4.247340
H  5.201635 2.364027 -4.476101
H  4.157454 0.982681 -4.085247
H  3.560757 2.280063 -5.137265
C  -2.026267 -4.581816 -1.405176
H  -2.545930 -5.521320 -1.174576
H  -2.683100 -3.990984 -2.057388
H  -1.123651 -4.830675 -1.982331
O  -1.433860 0.849276 2.167561
C  -2.437788 -0.079660 1.899051
C  -3.176974 -0.018659 0.697926
C  -2.778031 -0.997253 2.884865
C  -4.191879 -0.956993 0.482497
C  -3.815203 -1.909582 2.676422
C  -4.505452 -1.896886 1.466766
H  -2.225568 -0.984062 3.822129
H  -4.751108 -0.943701 -0.449484
H  -4.067677 -2.628422 3.453648
H  -5.302701 -2.615301 1.281305
O  -2.862294 0.989690 -0.159903
C  -3.448093 0.954191 -1.470474
H  -3.195342 0.014942 -1.980381
H  -4.537916 1.078324 -1.418092
H  -3.004347 1.794555 -2.009599
Au -0.020169 0.115861 -0.739424
Cl -0.055526 -0.754933 -2.892197
zeropoint: 0.002884 electronvolt
frequency: 18.05020909 28.47767930 cm-1
elementType: P C C C H H H H H H C C C H H H H H H C H H C H H C H H C H H C H H C H H C H C C H H H H H C H C C H H H H H C H H H C H H H O C C C C C C H H H H O C H H H Au Cl
mdcq: 0.90322646 -0.12027980 0.16699554 0.12118834 -0.03099640 -0.00814646 -0.08386014 -0.05270275 -0.03939679 -0.03380311 -0.14147300 0.15056900 0.12936975 -0.06071950 0.01351830 -0.08050913 -0.01808776 -0.05351819 -0.03474381 0.11454136 -0.05666737 -0.02387416 0.14062518 -0.17261688 -0.05858262 0.11248532 -0.06666934 -0.01580747 0.13719671 -0.16730200 -0.06135019 0.14386159 -0.06932600 -0.06254800 0.15307651 -0.06265175 -0.08724988 0.12423285 -0.07102257 0.17127381 0.14745981 -0.07375888 -0.06767324 -0.05722336 -0.06545518 -0.06968451 0.11703969 -0.07752413 0.15327618 0.17097103 -0.06629361 -0.05804921 -0.06647384 -0.05756589 -0.10594930 0.12253950 -0.04955533 -0.05487235 -0.04319090 0.14851657 -0.05473882 -0.05269420 -0.06150927 -0.47610567 0.19853691 0.15614233 -0.07241500 -0.06412736 -0.10296569 -0.09381246 0.08434888 0.06620044 0.07609074 0.05999511 -0.35128086 0.39829370 -0.06391308 -0.03160063 -0.03062466 0.06575684 -0.44436595
eener: -319.870189 electronvolt
kinener: 416.647704 electronvolt
coulombener: -136.135446 electronvolt
xcener: -403.953023 electronvolt
solvener: -0.322618 electronvolt
dispener: -5.439648 electronvolt
total: -449.073215 electronvolt
charge: 1.37297641 -0.24889807 0.55628488 0.55844744 -0.18929641 -0.22403501 -0.18814033 -0.18108677 -0.19745761 -0.20967240 -0.24885892 0.56601814 0.55659408 -0.16565877 -0.21562582 -0.19476250 -0.21953109 -0.19402070 -0.19537045 0.36581818 -0.17245030 -0.19062213 0.37616591 -0.09339217 -0.17954038 0.37262181 -0.15015647 -0.19002385 0.38534975 -0.05522902 -0.21444079 0.38162047 -0.18279765 -0.18530166 0.37391619 -0.19867027 -0.16295513 0.18595932 -0.14498181 0.50413511 0.37544911 -0.14222633 -0.17369494 -0.20613859 -0.19971549 -0.18512965 0.16214021 -0.15992449 0.39510899 0.50145298 -0.18859641 -0.20544041 -0.20491339 -0.13845393 -0.09705334 0.47628872 -0.17644464 -0.17590572 -0.20004719 0.47566864 -0.19539713 -0.19946020 -0.19234834 -0.66268348 0.35928776 0.42457328 0.16263826 0.12018413 0.14733225 0.13216356 -0.19524951 -0.16289554 -0.18919589 -0.18549712 -0.58657558 0.85499754 -0.13507364 -0.18110799 -0.20839727 -0.02731577 -0.57533468
quadrupole: 10.20958208 4.14559913 12.13657002 2.82947151 -8.43708581 -13.03905359
charge: 0
converged: GEOMETRY CONVERGED
charge: 1.3730 -0.2489 0.5563 0.5584 -0.1893 -0.2240 -0.1881 -0.1811 -0.1975 -0.2097 -0.2489 0.5660 0.5566 -0.1657 -0.2156 -0.1948 -0.2195 -0.1940 -0.1954 0.3658 -0.1725 -0.1906 0.3762 -0.0934 -0.1795 0.3726 -0.1502 -0.1900 0.3853 -0.0552 -0.2144 0.3816 -0.1828 -0.1853 0.3739 -0.1987 -0.1630 0.1860 -0.1450 0.5041 0.3754 -0.1422 -0.1737 -0.2061 -0.1997 -0.1851 0.1621 -0.1599 0.3951 0.5015 -0.1886 -0.2054 -0.2049 -0.1385 -0.0971 0.4763 -0.1764 -0.1759 -0.2000 0.4757 -0.1954 -0.1995 -0.1923 -0.6627 0.3593 0.4246 0.1626 0.1202 0.1473 0.1322 -0.1952 -0.1629 -0.1892 -0.1855 -0.5866 0.8550 -0.1351 -0.1811 -0.2084 -0.0273 -0.5753
