program: AMS
programVersion: 2023.101
runtype: GEOMETRY OPTIMIZATION
runtype: FREQUENCIES
method: DFT
functional: Becke88 Perdew86
functional: VWN
spinMolecule: Restricted
epsl: 7.58000
solvent: Tetrahydrofuran angstrom
formula: C32H43AuClO2P
InChI: InChI=1S/C32H43O2P.Au.ClH/c1-7-14-28-19-20-29(30(25-28)33-6)34-35(31(2,3)23-21-26-15-10-8-11-16-26)32(4,5)24-22-27-17-12-9-13-18-27;;/h8-13,15-20,25H,7,14,21-24H2,1-6H3;;1H/q;+1;/p-1
80 atoms
P  -0.444686 -0.824863 -0.022369
C  -1.963807 -1.072590 1.053152
C  -1.996987 0.143680 2.003233
C  -1.767130 -2.330652 1.919066
H  -1.895452 -3.258956 1.356459
H  -0.770396 -2.338133 2.382270
H  -2.504287 -2.319708 2.732356
H  -2.241896 1.077882 1.490276
H  -1.028564 0.271313 2.506734
H  -2.751373 -0.032482 2.780323
C  -3.228098 -1.160309 0.178765
H  -3.239188 -0.331081 -0.542600
H  -3.194206 -2.086219 -0.412187
C  -4.557184 -1.143934 0.956605
H  -4.655466 -0.200325 1.508809
H  -4.568931 -1.958606 1.693568
C  -5.717841 -1.298069 0.007983
C  -6.161469 -2.570216 -0.378200
C  -6.336401 -0.173819 -0.554611
C  -7.198517 -2.716530 -1.300913
C  -7.373895 -0.314548 -1.478328
C  -7.807567 -1.587843 -1.855533
H  -5.691079 -3.455104 0.053893
H  -6.004360 0.823039 -0.259729
H  -7.534393 -3.713637 -1.585680
H  -7.846831 0.571413 -1.901955
H  -8.618937 -1.700140 -2.574199
C  -0.269398 -2.056391 -1.427985
C  -0.557207 -3.469927 -0.896744
C  -1.195718 -1.737333 -2.610124
H  -0.986212 -2.460056 -3.411699
H  -2.252873 -1.832212 -2.341005
H  -1.032405 -0.729606 -3.002489
H  0.032079 -3.700918 0.000174
H  -0.276519 -4.193025 -1.674455
H  -1.618774 -3.619719 -0.673937
C  1.215987 -2.038873 -1.871448
H  1.835530 -2.318990 -1.005990
H  1.331315 -2.848134 -2.610124
C  1.758316 -0.732569 -2.469173
H  1.518418 0.108803 -1.807870
H  1.279577 -0.530805 -3.436335
C  3.254508 -0.793275 -2.640132
C  3.846608 -0.898277 -3.904248
C  4.088701 -0.765157 -1.512014
C  5.235942 -0.970238 -4.041432
C  5.474752 -0.835671 -1.642539
C  6.054844 -0.938283 -2.911011
H  3.211513 -0.920906 -4.791316
H  3.641636 -0.689168 -0.517895
H  5.678782 -1.049800 -5.034411
H  6.104649 -0.808371 -0.753319
H  7.138167 -0.992389 -3.016266
O  -0.766986 0.517293 -0.936907
C  -0.791090 1.844447 -0.513038
C  0.397713 2.532952 -0.199196
O  1.560647 1.836530 -0.325222
C  2.780126 2.489293 0.060494
H  2.751800 2.771721 1.121092
H  3.567228 1.749890 -0.102871
H  2.962774 3.374861 -0.562572
C  -2.008040 2.513835 -0.499991
C  -2.075429 3.856235 -0.125073
H  -3.038842 4.365094 -0.111848
C  -0.915242 4.543718 0.244346
C  0.313670 3.870845 0.198423
H  1.221125 4.407948 0.467293
Au 1.388643 -0.712422 1.265893
Cl 3.303659 -0.602741 2.583895
H  -2.905381 1.964997 -0.781559
C  -0.961288 6.003958 0.614029
H  -1.947010 6.245141 1.039010
H  -0.214995 6.213911 1.395353
C  -0.695240 6.922094 -0.592938
H  -1.439647 6.704653 -1.374098
H  0.286282 6.668891 -1.021987
C  -0.739459 8.404485 -0.222491
H  -0.547887 9.040373 -1.096878
H  0.016161 8.643025 0.539560
H  -1.722566 8.679916 0.185195
zeropoint: 0.001868 electronvolt
frequency: 11.31019676 18.81283116 cm-1
elementType: P C C C H H H H H H C H H C H H C C C C C C H H H H H C C C H H H H H H C H H C H H C C C C C C H H H H H O C C O C H H H C C H C C H Au Cl H C H H C H H C H H H
mdcq: 0.91318787 -0.14476999 0.12638074 0.11390432 -0.02260637 -0.11313539 0.01646310 -0.05043051 -0.10487977 0.02783678 0.14775790 -0.06134848 -0.03882796 0.16541448 -0.06059821 -0.06723070 -0.01648725 -0.09902584 -0.07867701 0.15730595 0.10231453 -0.41307508 0.05385126 0.06741352 0.02672515 0.03441987 0.13204111 -0.12301242 0.12840677 0.16991725 -0.02343859 -0.06157962 -0.04313327 -0.06613174 0.00688146 -0.03473387 0.10361626 -0.09889454 -0.02099911 0.14325189 -0.06551968 -0.02720863 0.01471537 -0.15625468 -0.02304921 -0.18913040 -0.18232565 -0.08977504 0.12142254 -0.00664612 0.14110209 0.13566936 0.11771761 -0.45192236 0.18087663 0.12728832 -0.34406899 0.39427549 -0.05504081 -0.01884131 0.00385977 -0.09257091 -0.17993388 0.13959010 -0.03849924 -0.18704321 0.11014897 0.00673414 -0.45877868 0.06765443 0.18965698 -0.05154418 -0.06298499 0.13969482 -0.06961258 -0.04778356 0.18783763 -0.05208235 -0.06195881 -0.05974348
eener: -361.532679 electronvolt
kinener: 436.466579 electronvolt
coulombener: -114.304460 electronvolt
xcener: -425.450382 electronvolt
solvener: -0.434212 electronvolt
dispener: -5.501121 electronvolt
total: -470.756281 electronvolt
charge: 1.33596801 -0.24067237 0.54735209 0.54640706 -0.18895123 -0.19235400 -0.20890984 -0.16079568 -0.18949191 -0.22003938 0.38905717 -0.14891360 -0.14772999 0.25259102 -0.17706147 -0.16875265 0.07465269 0.20156721 0.20249491 0.16524250 0.16657893 0.15793740 -0.20082342 -0.20115686 -0.18439917 -0.18499021 -0.18111930 -0.24818618 0.56532756 0.56912321 -0.21418719 -0.16945670 -0.18951638 -0.18988958 -0.20764035 -0.18624719 0.34151294 -0.15613600 -0.17250609 0.27199035 -0.08438968 -0.19144731 0.07783444 0.19539395 0.19390823 0.15280552 0.17354644 0.15535541 -0.20530166 -0.12094419 -0.18638879 -0.20261397 -0.18515161 -0.65583428 0.33462167 0.42390487 -0.59806071 0.86604999 -0.15917240 -0.18121046 -0.18180236 0.13040178 0.17821791 -0.19711833 0.07599046 0.12205676 -0.15554945 0.00184404 -0.56799685 -0.18236740 0.28358369 -0.17334478 -0.17031585 0.33816688 -0.15250046 -0.14864482 0.47268766 -0.19212068 -0.17067320 -0.17129675
quadrupole: -12.42398964 13.55461630 -16.77052964 26.61984746 9.23875146 -14.19585782
charge: 0
converged: GEOMETRY CONVERGED
charge: 1.3360 -0.2407 0.5474 0.5464 -0.1890 -0.1924 -0.2089 -0.1608 -0.1895 -0.2200 0.3891 -0.1489 -0.1477 0.2526 -0.1771 -0.1688 0.0747 0.2016 0.2025 0.1652 0.1666 0.1579 -0.2008 -0.2012 -0.1844 -0.1850 -0.1811 -0.2482 0.5653 0.5691 -0.2142 -0.1695 -0.1895 -0.1899 -0.2076 -0.1862 0.3415 -0.1561 -0.1725 0.2720 -0.0844 -0.1914 0.0778 0.1954 0.1939 0.1528 0.1735 0.1554 -0.2053 -0.1209 -0.1864 -0.2026 -0.1852 -0.6558 0.3346 0.4239 -0.5981 0.8660 -0.1592 -0.1812 -0.1818 0.1304 0.1782 -0.1971 0.0760 0.1221 -0.1555 0.0018 -0.5680 -0.1824 0.2836 -0.1733 -0.1703 0.3382 -0.1525 -0.1486 0.4727 -0.1921 -0.1707 -0.1713
