program: Gaussian 09
title: 000047214
version: EM64L-G09RevD.01
frameworkgroup: C1[X(C12H19N3O2)]
method: RPBEPBE
basis: SDD
operation: Freq
keyword: #p
keyword: freq=noraman
keyword: PBEPBE/SDD
title: #p freq=noraman PBEPBE/SDD
converged: YES YES NO NO
title: Mulliken charges:
elementType: O O N N N C C C C C C C C C C C C H H H H H H H H H H H H H H H H H H H
charge: -0.371772 -0.250891 -0.182863 -0.164232 -0.380239 0.362466 0.445374 -0.513492 0.241959 -0.388906 -0.361611 -0.655791 -0.653615 -0.644148 -0.650294 0.291914 -0.604479 0.249590 0.236333 0.232695 0.223871 0.249194 0.197222 0.274416 0.215169 0.206402 0.230554 0.212616 0.231719 0.233058 0.215739 0.225687 0.323316 0.226200 0.271760 0.225079
chargesum: 0.00000
title: Mulliken charges with hydrogens summed into heavy atoms:
elementType: O O N N N C C C C C C C C C C C C
charge: -0.371772 -0.250891 -0.182863 -0.164232 -0.056923 0.362466 0.445374 -0.263902 0.241959 -0.152572 -0.128916 0.014496 0.042372 0.030741 0.024190 0.291914 0.118560
polarizability: 2.33714575e+02 1.33863785e+01 1.62398193e+02 -1.14193383e+01 5.96212095e+00 1.08733518e+02
1716.lowfreq: -5.3056 -1.7001 0.0008 0.0009 0.0010 11.7042 27.0065 40.1957 46.6216
frequency: 26.8368 40.1699 46.6086 61.5533 77.7963 92.1737 106.9818 116.2035 137.0555 145.5616 154.4834 181.3460 212.0829 221.0175 237.2369 250.8041 270.0817 298.4999 312.7453 331.0285 347.2943 382.0166 424.4158 443.5047 466.5749 526.7872 545.8213 567.2141 575.3862 630.2311 649.6583 680.3387 689.0687 724.6913 755.0132 782.8363 824.1130 834.0953 874.8514 922.8226 943.1588 988.6070 1055.4993 1057.2312 1067.1538 1088.3313 1094.0323 1108.8010 1111.8600 1127.0906 1133.7789 1145.9269 1148.1809 1172.2474 1184.3818 1214.7463 1217.9527 1269.1269 1283.5253 1319.7732 1373.0568 1383.4884 1419.7694 1426.7365 1430.1477 1432.1739 1448.3067 1458.5652 1462.0922 1464.6674 1468.5558 1472.8821 1476.7537 1484.4529 1484.8965 1495.8664 1499.3972 1509.8758 1512.9372 1523.3527 1580.6228 1621.3074 1704.2013 2884.1122 2906.4050 2927.4430 2938.2064 2975.5894 2989.1298 2995.5653 3018.9904 3024.2459 3051.6588 3086.8988 3088.9048 3099.3872 3109.2102 3122.8436 3145.0230 3176.8515 3180.5903 3576.7940
redmass: 4.2956 3.8098 4.6539 2.7960 2.6921 2.3902 1.1355 2.2087 2.1869 2.0743 2.9634 1.3929 1.2428 2.2461 3.0617 1.5790 1.8833 4.4052 4.1669 3.2205 3.5604 5.4908 2.8758 3.4632 3.0577 4.2300 3.6678 1.2299 3.2085 4.9973 3.1968 5.6090 11.9886 2.6610 4.8779 1.7424 2.0226 5.0283 4.6646 1.3732 3.3468 2.3741 1.5682 1.4950 4.2555 2.6885 1.2954 1.3008 1.2524 1.2814 1.4057 1.6362 1.4134 1.8736 1.9391 3.6973 2.0909 2.9799 1.6963 2.7223 3.2748 7.7613 1.9029 1.1677 1.1589 1.2314 1.2576 1.3271 1.0417 1.3365 1.0544 1.0482 1.0864 1.0452 1.0619 1.0775 1.2581 1.3060 1.2159 2.2599 6.8049 6.2059 9.5561 1.0548 1.0532 1.0376 1.0397 1.0355 1.0992 1.1016 1.0836 1.0760 1.1025 1.1003 1.0955 1.0934 1.0979 1.0954 1.0889 1.0926 1.0905 1.0770
irintensity: 0.1917 3.5143 7.3382 2.5048 3.0552 3.1198 0.1126 3.3388 0.9855 1.0065 0.8948 1.2013 0.9419 2.1732 0.4385 0.2620 4.2686 7.5689 14.2968 0.3649 11.1011 5.5441 2.4097 1.6576 10.6675 1.0391 0.3681 119.1992 8.4401 10.5237 2.6421 0.7197 20.9079 3.2108 6.5337 30.3115 40.7517 19.2850 60.5606 5.7944 18.2783 53.3442 17.5920 40.9387 171.5350 141.1795 23.2057 1.2731 0.3182 0.3242 52.5975 44.3999 4.6842 271.6825 108.6143 11.8027 6.0900 21.3267 15.7719 74.1676 38.7345 20.4528 9.6511 10.9904 27.5655 8.1243 73.2577 106.9260 0.6048 46.8623 26.1586 26.3930 26.4001 15.9750 40.1704 3.5487 15.2036 308.0267 10.6874 65.1736 72.6298 324.1704 234.7825 91.5248 174.0303 124.4244 92.8559 96.2455 31.8001 69.0049 58.4200 34.6169 39.4459 27.7069 3.8276 52.6437 4.1871 5.2981 10.6201 17.5367 6.5159 31.3392
temp: 298.150 k
press: 1.00000 atm
elementType: 8 8 7 7 7 6 6 6 6 6 6 6 6 6 6 6 6 1 1 1 1 1 1 1 1 1 1 1 1 1 1 1 1 1 1 1
symmnumber: 1
zpe: 784333.7 jmol-1
zpe.correction: 0.298737 hartree
zpe.thermalcorrener: 0.318066 hartree
zpe.thermalcorrenthalpy: 0.319010 hartree
zpe.thermalcorrgfe: 0.250136 hartree
zpe.sumelectzpe: -782.051051 hartree
zpe.sumelectthermal: -782.031722 hartree
zpe.sumelectthermalent: -782.030778 hartree
zpe.sumelectthermalfe: -782.099652 hartree
dipole: -0.5262 1.7528 -1.4701
dipole: 2.3474
quadrupole: -67.2431 -93.1786 -108.4094
quadrupole: 1.0307 -7.9615 3.4345
quadrupole: 22.3672 -3.5682 -18.7990 1.0307 -7.9615 3.4345
hfenergy: -782.3497883 hartree
pointgroup: C01 [X(C12H19N3O2)]
dipole: -0.2018486 -0.7533651 0.4945697 debye
polarizability: 233.7185133|-12.772615|159.7258982|13.6947239|11.4124128|111.4018748 unknown
InChI: InChI=1S/C12H19N3O2/c1-13-12(16)17-11-7-6-9(14(2)3)8-10(11)15(4)5/h6-8,13H,1-5H3
charge 0 multiplicity 1
36 atoms
O  1.836325 0.551741 0.960042
O  2.352459 1.151765 -1.291044
N  0.713821 -1.905604 -0.100305
N  -3.694055 0.30399 -0.311544
N  4.003239 0.82743 0.355821
C  -0.10506 -0.771863 0.137419
C  -2.331005 0.35384 0.020142
C  -1.491561 -0.785092 -0.175337
C  0.437847 0.442575 0.659004
C  -1.7529 1.536228 0.577639
C  -0.378785 1.559372 0.881788
C  0.215855 -2.958175 -0.992473
C  1.5940 -2.404719 0.974812
C  -4.547351 1.470788 -0.066075
C  -4.262364 -0.903152 -0.916778
C  2.713814 0.870651 -0.128071
C  5.159672 1.145444 -0.483184
H  -1.927091 -1.713204 -0.549935
H  -2.352915 2.431916 0.752469
H  0.085226 2.470425 1.274618
H  1.064227 -3.600567 -1.290786
H  -0.213187 -2.511222 -1.905123
H  -0.555023 -3.615388 -0.522441
H  1.965888 -1.565757 1.57899
H  2.460597 -2.93332 0.5348
H  1.059213 -3.115609 1.646558
H  -4.556824 1.755936 1.006328
H  -5.582803 1.237375 -0.361571
H  -4.21828 2.356606 -0.648584
H  -3.744163 -1.172995 -1.860365
H  -5.324415 -0.730444 -1.15364
H  -4.205209 -1.779747 -0.236833
H  4.124051 0.595953 1.341744
H  5.697299 2.038427 -0.11219
H  4.790809 1.355301 -1.499929
H  5.866847 0.296594 -0.532266
