program: Gaussian 16
title: cis-9-t frequency and population
version: ES64L-G16RevA.03
frameworkgroup: C1[X(C6H16Cl2MoO5)]
method: UB3PW91
basis: def2SVP
operation: Freq
keyword: #N
keyword: Geom=AllCheck
keyword: Guess=TCheck
keyword: SCRF=Check
keyword: GenChk
keyword: UB3PW91/def2SVP
keyword: Freq
converged: YES YES YES YES
elementType: C
elementType: O
elementType: H
elementType: Mo
elementType: Cl
1716.lowfreq: -593.0470 -3.9612 -0.0017 0.0019 0.0026 5.7613 6.1901 59.6776 79.6789
frequency: -593.0470 59.6737 79.6787 97.2976 105.3949 143.9836 159.0827 176.6979 206.9639 217.6021 231.2884 237.1495 244.0969 261.7612 280.5295 290.1197 293.7959 296.6580 313.5478 322.8935 334.9254 360.6720 369.1716 377.8744 395.3899 457.0937 478.8208 499.2127 520.6841 537.7176 550.1062 554.7212 619.5295 646.7738 660.7217 702.6561 725.6083 884.4001 915.0589 929.9467 931.5012 940.2701 967.7261 991.4202 997.3795 1008.4667 1048.9309 1150.1783 1169.4734 1180.6373 1218.8235 1253.6277 1259.9608 1357.4940 1376.5862 1382.7799 1389.5547 1400.0044 1438.4302 1448.9064 1452.5874 1454.8621 1467.3311 1476.0701 1476.8348 1489.5728 1534.0157 1651.6405 1752.3411 2203.2675 3053.2769 3058.4330 3060.8758 3064.4841 3142.7395 3151.9686 3154.0648 3158.9248 3161.9770 3166.6687 3177.0789 3178.2103 3763.5380 3855.7027
redmass: 1.4860 4.0936 8.1320 6.2445 6.8753 6.7954 6.4546 5.0744 8.8141 4.5373 3.3892 3.5489 1.3328 1.0931 7.1948 2.4106 2.3800 1.3259 1.3862 4.1556 3.5498 2.4199 5.3741 4.5329 2.9937 2.8929 2.6742 2.2139 3.7228 1.6274 3.3244 2.0436 2.7213 3.2977 1.4084 2.1147 2.8378 2.5758 2.2094 1.5226 1.4643 1.4451 2.5690 1.7083 1.4983 1.4323 4.5872 2.2497 2.3321 3.0918 2.9330 3.1845 2.9005 1.1644 1.3327 1.3611 1.2738 1.2428 1.0534 1.0449 1.0526 1.0480 1.0470 1.0665 1.0522 1.0553 1.0599 1.0700 1.0748 1.0408 1.0371 1.0371 1.0369 1.0367 1.1037 1.1043 1.1038 1.1040 1.1035 1.1043 1.1037 1.1046 1.0633 1.0665
irintensity: 179.1899 0.1963 1.2222 0.4189 1.5473 2.8568 0.2566 0.4959 2.2546 9.8594 3.3010 9.3007 1.7217 0.1735 17.8926 10.4973 8.0342 3.4019 4.7654 10.9264 28.9158 11.3415 23.9638 83.5516 14.9690 20.9722 125.2488 69.8580 13.2837 117.5226 25.6454 49.9364 70.2809 34.1333 40.4857 101.2603 71.2090 2.8622 82.9722 5.0553 3.0957 21.6397 92.0321 65.7980 24.4590 38.4782 239.9726 72.5025 54.3858 126.8615 16.0103 8.5834 24.1791 1019.0562 17.5390 17.6929 5.4965 11.2766 13.9966 6.8893 25.6509 1.2402 3.8325 0.6533 12.6068 5.8696 290.5661 113.3536 632.5631 1585.4557 8.3790 10.5014 10.3204 21.0345 5.5430 9.8429 8.3555 15.9251 6.9441 6.2216 6.0314 3.2680 72.6194 130.6371
temp: 298.150 k
press: 1.00000 atm
elementType: 6 8 6 8 6 6 6 6 1 1 1 1 1 1 1 1 1 1 1 1 1 42 8 17 17 8 1 8 1 1
symmnumber: 1
zpe: 601469.9 jmol-1
zpe.correction: 0.229088 hartree
zpe.thermalcorrener: 0.246923 hartree
zpe.thermalcorrenthalpy: 0.247868 hartree
zpe.thermalcorrgfe: 0.185258 hartree
zpe.sumelectzpe: -1601.976115 hartree
zpe.sumelectthermal: -1601.958279 hartree
zpe.sumelectthermalent: -1601.957335 hartree
zpe.sumelectthermalfe: -1602.019945 hartree
dipole: -4.2914 2.8575 0.6774
dipole: 5.2000
quadrupole: -111.9666 -114.1243 -114.6135
quadrupole: 7.2961 2.3761 1.5109
quadrupole: 1.6015 -0.5561 -1.0454 7.2961 2.3761 1.5109
hfenergy: -1602.2052027 hartree
pointgroup: C01 [X(C6H16Cl2Mo1O5)]
dipole: -1.5046995 -1.3782946 0.1472034 debye
polarizability: 144.5943027|12.7088977|167.1202606|0.3975549|12.9866566|147.2754525 unknown
InChI: InChI=1S/C6H12O2.2ClH.Mo.H4O2.O/c1-5(2,7)6(3,4)8;;;;1-3-2;/h1-4H3;2*1H;;1H,2H2;/q-2;;;+4;;/p-2
charge 0 multiplicity 1
30 atoms
C  -1.18448483 1.9048109 0.04164972
O  -0.96720486 3.0230037 0.89235652
C  -0.15913517 0.81211275 0.54587812
O  0.95014005 1.55535325 1.06714076
C  -0.91103348 2.35230398 -1.39715537
C  -2.63817244 1.44354868 0.154858
C  -0.67757055 -0.01911758 1.72237815
C  0.37696586 -0.1046191 -0.5489837
H  -1.91086774 3.42940595 1.82307614
H  -1.54713584 3.22233674 -1.61558975
H  0.13278618 2.66522899 -1.53483195
H  -1.14736654 1.56294396 -2.12563316
H  -3.30218975 2.22341516 -0.2471759
H  -2.8114815 0.52637354 -0.42874585
H  -2.93214748 1.25225183 1.19570147
H  0.14857524 -0.62136637 2.12692618
H  -1.05724283 0.62165185 2.52862112
H  -1.47339092 -0.70334253 1.39545171
H  1.06601 -0.84225937 -0.11325084
H  -0.4506712 -0.64936355 -1.02780384
H  0.91988807 0.45751731 -1.3190612
Mo 0.97761131 3.29969765 1.67454045
O  2.31490251 3.18920957 2.67248288
Cl 0.19248619 5.50890635 2.1696531
Cl 1.96880984 4.21157797 -0.20164421
O  -0.15275985 2.84682646 3.36969341
H  0.32465823 2.99183459 4.19739736
O  -2.29493615 3.72278155 2.79182519
H  -2.1475738 4.68412652 2.79063077
H  -1.33570052 3.31901726 3.27019071
