program: Gaussian 09
title: 000047198
version: EM64L-G09RevD.01
frameworkgroup: C1[X(C9H12N2O)]
method: RPBEPBE
basis: SDD
operation: Freq
keyword: #p
keyword: freq=noraman
keyword: PBEPBE/SDD
title: #p freq=noraman PBEPBE/SDD
converged: YES YES NO NO
title: Mulliken charges:
elementType: O N N C C C C C C C C C H H H H H H H H H H H H
charge: -0.330384 -0.626645 -0.357628 0.478138 0.424662 -0.583508 -0.380245 -0.379652 -0.215118 -0.319302 -0.805529 0.076038 0.246007 0.230886 0.253630 0.223522 0.248071 0.245515 0.224280 0.231448 0.231196 0.312653 0.354610 0.217355
chargesum: 0.00000
title: Mulliken charges with hydrogens summed into heavy atoms:
elementType: O N N C C C C C C C C C
charge: -0.330384 0.040619 -0.140274 0.478138 0.424662 -0.337501 -0.149359 -0.126022 0.008404 0.174284 -0.118605 0.076038
polarizability: 1.66566336e+02 6.87257905e+00 1.21236828e+02 8.35013029e-01 2.40347296e-01 5.66626770e+01
1716.lowfreq: -13.5664 -0.0002 0.0004 0.0004 3.1606 11.2964 16.3529 32.0396 48.6509
frequency: 5.5017 32.0231 48.4067 99.7685 111.6408 212.7164 227.8736 245.6711 264.5859 376.2311 442.3829 449.8272 486.7807 503.5925 513.1302 542.4008 559.9974 583.7127 608.6767 692.8772 736.7871 780.9854 798.9978 867.0290 884.2089 888.0270 901.2389 969.2004 980.8634 983.1082 1016.0597 1024.3028 1046.2148 1060.0406 1081.8455 1101.1278 1158.3108 1185.6251 1201.6512 1256.5393 1298.2238 1342.0585 1384.6728 1394.7601 1399.7892 1435.4759 1466.0317 1469.3176 1476.9462 1485.3385 1586.5309 1593.9372 1625.2298 1651.9033 2977.7049 2991.8958 3056.8281 3058.5785 3085.5498 3125.1869 3144.2220 3147.8546 3170.8250 3344.8712 3514.1067 3675.5762
redmass: 4.9760 1.0505 5.2231 4.3528 2.3043 2.9819 4.8477 4.5476 4.0013 3.4880 2.4665 1.2016 2.5106 4.5246 5.1778 2.4664 3.6053 1.0786 6.4966 2.1039 6.6155 1.4409 1.3293 1.3142 3.6526 1.4690 3.7121 1.3225 2.1160 4.3257 1.6736 2.2754 1.5558 1.4790 1.6734 1.5914 1.7785 1.1430 1.0674 3.9651 1.3322 1.3469 4.8871 1.2823 3.9726 2.0780 1.1033 1.0458 2.3261 1.3569 1.5145 3.1928 5.7625 5.7549 1.0371 1.0564 1.0976 1.1066 1.0990 1.0866 1.0922 1.0935 1.0961 1.0765 1.0454 1.1033
irintensity: 8.7094 0.5095 0.6691 2.4742 1.2876 2.0996 0.5750 10.0870 5.0716 8.2442 3.0411 170.0320 8.0808 18.1532 5.1798 13.1787 1.2058 141.4783 3.6478 24.2004 8.9750 50.7507 90.8405 6.1608 16.4226 14.9152 2.4001 0.2299 36.0815 0.0111 2.3069 177.7124 14.1671 34.9981 52.6526 9.3722 102.1542 1.3187 1.2814 135.0267 2.2692 2.1429 15.0966 2.3971 94.2546 31.5308 31.2208 12.9988 18.5812 68.0796 215.0384 4.4623 82.0321 257.9343 33.8675 16.0919 19.5157 20.1899 20.1312 5.2015 26.3215 11.3237 9.0161 26.3090 53.5740 50.6592
temp: 298.150 k
press: 1.00000 atm
elementType: 8 7 7 6 6 6 6 6 6 6 6 6 1 1 1 1 1 1 1 1 1 1 1 1
symmnumber: 1
zpe: 513397.6 jmol-1
zpe.correction: 0.195543 hartree
zpe.thermalcorrener: 0.207782 hartree
zpe.thermalcorrenthalpy: 0.208726 hartree
zpe.thermalcorrgfe: 0.153828 hartree
zpe.sumelectzpe: -533.975919 hartree
zpe.sumelectthermal: -533.963679 hartree
zpe.sumelectthermalent: -533.962735 hartree
zpe.sumelectthermalfe: -534.017634 hartree
dipole: -1.3002 -2.5010 -0.2184
dipole: 2.8272
quadrupole: -66.0892 -63.7952 -76.4217
quadrupole: -12.1840 -0.7541 -0.0930
quadrupole: 2.6795 4.9736 -7.6530 -12.1840 -0.7541 -0.0930
hfenergy: -534.1714614 hartree
pointgroup: C01 [X(C9H12N2O1)]
dipole: -0.4818918 -0.9828383 -0.1975539 debye
dipolederiv: -2.0176339 0.0160993 0.0609352 0.1440306 -0.3511962 -0.0095502 0.0818061 -0.0058391 -0.2874674 -0.467429 0.0015047 -0.0058308 -0.2849457 -1.1171231 -0.0892178 -0.0622665 -0.1051481 -0.6764235 -0.9278009 -0.4452132 -0.0806422 -0.4964137 -0.5653145 -0.0013029 -0.0839421 0.0013831 -0.5102418 0.3576234 0.1170534 0.002297 0.160822 0.2815223 0.0285865 0.0062522 0.0296743 -0.0155525 1.6350757 -0.1234462 -0.0620793 -0.4257548 0.184405 0.0210479 -0.0910327 0.0085501 0.1303384 -0.5216504 -0.0478313 0.0055473 -0.1988806 -0.0221835 0.0255969 -0.0115901 0.0215794 -0.2052872 -0.0897342 -0.0938899 -0.0138036 -0.1407054 -0.2805625 -0.0024905 -0.0199946 -0.0039348 -0.2196979 -0.3428724 -0.0056479 0.0049027 0.3329419 -0.1491523 -0.0013502 0.0429608 0.01083 -0.2291197 0.2016492 0.0556595 -0.0036852 -0.030434 0.1528403 0.0324034 -0.0129182 0.0300277 -0.1238759 0.7089203 0.1622159 0.0045031 0.6113645 0.2444875 -0.0418879 0.0417764 -0.027069 0.3597881 -0.0909521 -0.1460818 -0.0114287 -0.0765258 0.0027725 -0.0049637 -0.0032565 -0.0023769 0.0667066 1.0974526 0.2913795 0.0424382 0.3891837 1.208382 0.2154517 0.07328 0.2117313 0.0880678 0.0884305 0.0501571 0.0080432 0.0563289 -0.0657426 -0.0271473 0.0086455 -0.0279846 0.1622662 -0.1272738 0.0461499 0.0135793 0.0324054 0.0823916 -0.0099268 0.0120977 -0.0103894 0.161696 0.0012679 -0.0980321 -0.0065391 -0.1135659 0.0227898 -0.0137801 -0.0086698 -0.014674 0.1749156 0.0554259 0.0497728 0.0083535 0.0635705 -0.1096468 -0.0312571 0.0098319 -0.0310246 0.1485984 0.0040484 0.00208 0.0291916 -0.0977648 0.0208998 -0.0666104 0.0057028 -0.0719182 -0.0540529 -0.0127782 0.022047 -0.0339645 -0.0890292 -0.0179693 0.082986 -0.0273155 0.0819122 -0.0207903 0.0419715 0.1344459 0.017054 0.0222729 -0.113771 -0.0254615 0.0043167 -0.0290003 0.1033838 -0.0084534 -0.0519056 0.1021687 -0.0370649 0.0548598 -0.0262088 0.1372236 0.0279391 -0.0510826 -0.0232931 -0.0283762 -0.1127346 -0.0029063 0.0496871 0.0490409 -0.1435026 -0.0041684 -0.0313267 0.0804817 0.0082641 0.006771 0.0094418 0.2001839 -0.0326565 0.0037035 -0.0289624 0.3801655 0.3711142 -0.0674493 -0.0106345 -0.163812 0.2052998 -0.0271513 -0.0307027 -0.0215399 0.384623 -0.0135899 0.1510442 0.0355576 0.3354411 0.0821406 -0.0441502 0.0675941 -0.0395976 0.2643692 unknown
polarizability: 165.9921228|8.6618196|120.6559243|-1.9309257|8.2976208|57.8177938 unknown
InChI: InChI=1S/C9H12N2O/c1-7-3-2-4-8(5-7)12-6-9(10)11/h2-5,10H,6,11H2,1H3
charge 0 multiplicity 1
24 atoms
O  0.990054 -0.356575 -0.201061
N  3.357026 -1.379201 -0.522631
N  4.45011 0.774547 -0.138857
C  -2.697724 -0.64127 -0.124185
C  -0.347246 0.075848 -0.112585
C  -1.321999 -0.94865 -0.197976
C  -3.08644 0.717961 0.038114
C  -0.731764 1.427121 0.050178
C  -2.111832 1.731668 0.12361
C  2.047064 0.662364 -0.12799
C  -3.746323 -1.737108 -0.215755
C  3.410167 -0.017918 -0.266609
H  -0.984974 -1.983495 -0.322164
H  -4.150791 0.973887 0.097362
H  0.007697 2.229621 0.120608
H  -2.420147 2.775666 0.249615
H  2.011761 1.193623 0.840922
H  1.93009 1.398716 -0.945823
H  -3.286377 -2.732076 -0.341619
H  -4.37294 -1.767184 0.695367
H  -4.426092 -1.568055 -1.071895
H  4.20586 -1.928645 -0.6322
H  2.442338 -1.829308 -0.567867
H  5.366183 0.295962 -0.252262
