program: Gaussian 16
title: ts-new wfx
version: ES64L-G16RevC.01
frameworkgroup: C1[X(C6H9Cl2MoNO3)]
method: UB3PW91
basis: def2SVP
operation: SP
keyword: #UB3PW91/Def2SVP
keyword: SP
keyword: SCF=(conver=12,qc,tight)
keyword: gfinput
keyword: Integral(SuperFineGrid)
keyword: #SCRF=(solvent=o-xylene)
keyword: IOP(6/7=3)
keyword: geom=check
keyword: guess=readOutput=WFX
title: #UB3PW91/Def2SVP SP SCF=(conver=12,qc,tight) gfinput Integral(SuperFin
elementType: C
elementType: N
elementType: O
elementType: Mo
elementType: Cl
elementType: H
dipole: 4.6595 2.4645 -5.2408
dipole: 7.4331
quadrupole: -75.9189 -107.2826 -101.9266
quadrupole: -5.9732 13.3620 -0.5503
quadrupole: 19.1238 -12.2399 -6.8839 -5.9732 13.3620 -0.5503
hfenergy: -1502.3695352 hartree
pointgroup: C01 [X(C6H9Cl2Mo1N1O3)]
dipole: 1.7667705 1.0113203 -2.0994908 debye
InChI: InChI=1S/C6H7NO.2ClH.Mo.H2O.O/c8-9-7-6-4-2-1-3-5-6;;;;;/h1-5,7H;2*1H;;1H2;/q-1;;;+3;;/p-2
charge 0 multiplicity 1
22 atoms
C  4.00795001 1.18502787 0.06640973
C  5.1916927 0.73692975 -0.49064527
C  5.39457697 -0.63501596 -0.71876109
C  4.39517269 -1.5623262 -0.37835711
C  3.20918187 -1.13624678 0.19054299
C  2.98095166 0.25715678 0.43337147
N  1.83754852 0.6349818 1.01091904
O  -0.23404843 -0.68703267 0.7033662
Mo -1.85466002 0.02513679 0.30864463
O  -2.58005043 0.4392154 1.74277113
O  -3.26670653 0.60200862 -1.27600932
Cl -2.74070703 -2.09517132 -0.30554057
Cl -0.80220247 2.01509731 -0.47368175
H  -3.03685161 1.33538668 -1.86766194
H  -3.67766574 -0.11943235 -1.77963506
H  4.55734397 -2.62732804 -0.56118376
H  2.42244214 -1.84311091 0.46245883
H  3.84021046 2.25165541 0.23892691
H  5.97134059 1.45374539 -0.75978424
H  6.3308502 -0.98038129 -1.16349799
H  1.73380311 1.64863711 1.08838825
H  0.70111949 -0.10292334 0.91549917
