program: Gaussian 16
title: 8-s-stab frequency and population
version: ES64L-G16RevC.01
frameworkgroup: C1[X(C6H7Cl2MoNO3)]
method: UB3PW91
basis: def2SVP
operation: Freq
keyword: #UB3PW91/Def2SVP
keyword: Freq=NoRaman
keyword: SCF=tight
keyword: gfinput
keyword: Integral(SuperFineGrid)
keyword: #SCRF=(solvent=o-xylene)
keyword: geom=check
keyword: guess=read
keyword: POP=None
title: #UB3PW91/Def2SVP Freq=NoRaman SCF=tight gfinput Integral(SuperFineGrid
converged: YES YES NO YES
1716.lowfreq: -42.4447 -0.0021 -0.0008 0.0016 16.0728 23.3239 30.0951 43.9412 58.0015
frequency: 27.1735 41.9459 53.9107 92.7293 130.6036 134.7960 148.1642 176.1037 185.1186 213.0010 231.9820 260.2534 279.7524 306.8339 362.9430 370.8015 403.2152 415.0413 445.9531 448.5280 477.9230 611.5044 619.9120 666.6826 701.0141 701.7558 794.8110 854.4411 926.4451 959.8476 1008.3425 1010.8951 1032.1905 1045.3982 1069.1712 1100.2888 1162.6826 1170.1356 1227.7826 1321.6549 1390.2780 1411.6279 1495.0214 1510.4889 1527.4486 1652.6663 1659.2553 3200.4267 3210.6631 3219.3294 3233.6258 3240.8566 3723.6460 3830.1641
redmass: 4.2378 7.5214 10.4895 11.5385 8.5292 12.3416 10.0746 3.1661 6.2402 10.6362 13.9086 11.8985 7.7022 22.1947 6.3730 5.4722 1.3405 2.7776 1.5072 2.8797 7.1164 2.5004 6.3525 1.6132 4.7062 1.9807 1.8911 1.2535 7.7498 1.4247 1.3727 5.1739 1.3476 1.9728 13.4286 1.4291 1.2337 1.1310 3.0845 1.4008 7.4107 8.9620 2.7465 2.3685 1.0950 6.5907 6.2325 1.0874 1.0921 1.0973 1.0961 1.0948 1.0432 1.0860
irintensity: 0.0814 9.5179 2.7828 5.7725 0.8472 3.7773 8.9212 8.5647 0.6279 1.0832 0.2539 26.4407 15.6273 21.6723 70.2594 204.7376 94.9233 5.5173 169.1788 37.7121 16.3940 13.9509 0.5930 8.9415 5.8115 30.1707 42.7287 0.0370 24.4698 3.5880 0.0602 4.8055 0.0191 12.3431 182.2630 14.5323 9.5133 2.6210 2.1213 12.9117 235.8895 77.4035 47.8623 8.1275 207.9754 5.4351 18.8957 0.7318 7.2741 10.5567 4.4282 3.9620 117.9973 207.5786
temp: 298.150 k
press: 1.00000 atm
elementType: 1 1 42 17 8 8 17 6 6 6 6 6 6 1 1 1 1 1 7 8
symmnumber: 1
zpe: 343909.8 jmol-1
zpe.correction: 0.130988 hartree
zpe.thermalcorrener: 0.145928 hartree
zpe.thermalcorrenthalpy: 0.146872 hartree
zpe.thermalcorrgfe: 0.086820 hartree
zpe.sumelectzpe: -1501.005004 hartree
zpe.sumelectthermal: -1500.990064 hartree
zpe.sumelectthermalent: -1500.989120 hartree
zpe.sumelectthermalfe: -1501.049172 hartree
hfenergy: -1501.1359922 hartree
pointgroup: C01[X(C6H7Cl2Mo1N1O3)]
dipole: 0.0755713 -0.0332202 0.0549873 debye
dipolederiv: 0.4795051 -0.0479967 0.0045778 -0.0193024 0.3582825 0.015608 0.0395992 0.0089417 0.323903 0.4803814 0.0443604 0.010127 -0.0014373 0.3617611 -0.0111418 0.0580066 -0.0044032 0.3183836 2.1484831 0.0382936 -0.4513206 0.014098 2.4026092 0.0390659 -0.0249764 0.0368394 1.7760927 -0.4832838 0.1717477 0.0749616 0.6513435 -1.1255069 -0.1214256 0.3154661 -0.2536391 -0.2928322 -0.2897264 -0.0063115 0.2045485 0.0033958 -0.3420273 0.0389598 -0.2079352 0.0458618 -1.4672156 -1.085551 0.008564 0.0067723 0.0186431 -0.4988677 -0.0022634 -0.0873322 -0.0032117 -0.4033291 -0.507833 -0.205634 0.0554196 -0.6903627 -1.1371303 0.0424018 0.2533547 0.1691324 -0.2714641 -0.1310685 -0.0183346 0.2075408 -0.0362917 -0.1213471 -0.0082747 0.4148428 -0.007994 -0.0389329 0.2035447 0.0127038 -0.159947 -0.0112319 -0.066283 -0.0016192 0.1823563 -0.0028422 -0.0541212 -0.1622958 -0.0146184 0.2226999 -0.0123164 0.0488461 -0.0005388 0.0953244 -0.0030152 0.0392149 0.0246239 -0.0028102 0.0200074 0.0139656 -0.0610464 0.007118 -0.2989567 0.0017317 -0.0913476 -0.2955798 0.0108097 -0.1099469 0.0267019 -0.1277323 -0.0233178 -0.2214963 -0.0213991 0.1211961 -0.0547958 0.0031313 -0.0337627 0.0036231 -0.0825438 -0.0124584 -0.0431955 -0.0128472 0.0536684 -0.0214009 0.0066921 -0.0701095 0.0079732 0.1313196 0.0115128 -0.0881637 0.0107789 0.0146037 0.1585839 -0.0053043 0.055819 -0.0076986 0.1287858 0.0052398 0.0263702 0.0064291 0.0669624 0.0763236 0.0056052 -0.0681934 0.0058822 0.130845 0.0016709 -0.0357573 0.003958 0.0911233 0.0544503 -0.0020573 0.026569 -0.005414 0.1307315 0.0155815 0.0706653 0.0149527 -0.0396742 -0.0628832 -0.002546 0.0353459 -0.0045498 0.1294763 0.0037511 0.0393743 0.0037615 0.087602 -0.5417364 0.0171879 -0.2018312 -0.0247252 -0.0314983 -0.0458838 0.9963473 -0.0535994 0.9625489 0.0102587 -0.0134826 0.1707226 0.0677037 -0.228674 0.0460139 -1.483894 0.0605636 -1.1963821 unknown
polarizability: 313.6355939|-0.3176026|123.5038746|5.2030886|-3.3732714|149.3194678 unknown
InChI: InChI=1S/C6H5NO.2ClH.Mo.H2O.O/c8-7-6-4-2-1-3-5-6;;;;;/h1-5H;2*1H;;1H2;/q-1;;;+3;;/p-2
charge 0 multiplicity 1
20 atoms
H  3.7342387 -0.81218654 -0.38307625
H  3.74608777 0.77958877 -0.29626566
Mo 1.17243842 -0.01260975 0.26949564
Cl 1.5116051 -2.2487277 -0.43392825
O  0.82434059 -0.07810043 1.88199432
O  3.34380406 -0.03480286 0.0499896
Cl 1.5976543 2.26415506 -0.24176932
C  -4.24337383 0.09709837 -0.91919132
C  -2.89515524 0.12139682 -1.26013678
C  -1.93330425 0.02822738 -0.24324604
C  -2.31019298 -0.08781375 1.10199914
C  -3.66322028 -0.11260417 1.42558443
C  -4.63031332 -0.02059967 0.41979648
H  -5.00045836 0.16997433 -1.70353158
H  -2.56270994 0.21097382 -2.29465771
H  -1.54782971 -0.16077749 1.8787124
H  -3.96564905 -0.20596847 2.47106386
H  -5.69115487 -0.04108712 0.68097721
N  -0.56211547 0.0471522 -0.59282391
O  -0.23272463 0.1053452 -1.80543725
