program: Gaussian 16
title: Title Card Required
version: ES64L-G16RevC.01
method: RwB97XD
basis: def2SVPP
operation: Freq
keyword: #N
keyword: Geom=AllCheck
keyword: Guess=TCheck
keyword: SCRF=Check
keyword: GenChk
keyword: RwB97XD/def2SVPP
keyword: Freq
converged: YES YES YES YES
title: Mulliken charges:
elementType: B F C C C C C O O Si C H H H C H H H C H H H C C C C H C H C H H H C C C C H C H C H H H C C O O C C C C F C F C F F F C C C C F C F C F F F C C C C F C F C F F F F F F F C C C C H C H C H H H C C C C H C H C H H H
charge: 0.274710 -0.252634 -0.022661 0.152626 -0.090346 0.311835 0.343766 -0.429043 -0.278592 0.750697 -0.629335 0.178537 0.178776 0.187719 -0.588596 0.172491 0.168073 0.173632 -0.616643 0.179606 0.170432 0.179065 0.032199 -0.115690 -0.120282 -0.110384 0.154692 -0.099638 0.121324 -0.076452 0.127744 0.127427 0.133244 0.041355 -0.131217 -0.119665 -0.096696 0.122669 -0.126169 0.160542 -0.076970 0.124554 0.128076 0.126560 0.477674 0.237779 -0.193491 -0.302041 -0.138605 0.124016 0.135005 0.221148 -0.200519 0.208870 -0.197801 0.109352 -0.188060 -0.191740 -0.188139 -0.073589 0.133268 0.095981 0.240733 -0.197625 0.220154 -0.200732 0.112564 -0.193229 -0.189995 -0.185081 -0.155071 0.147456 0.133134 0.229667 -0.202754 0.219055 -0.200452 0.095589 -0.191714 -0.193632 -0.190431 -0.162249 -0.170806 -0.173124 -0.188320 0.240934 -0.126284 -0.163180 -0.108941 0.116458 -0.105696 0.126780 -0.089899 0.123849 0.123475 0.120633 0.238524 -0.148621 -0.148020 -0.111051 0.120278 -0.119814 0.123289 -0.085060 0.122578 0.118055 0.118131
chargesum: -0.00000
title: Mulliken charges with hydrogens summed into heavy atoms:
elementType: B F C C C C C O O Si C C C C C C C C C C C C C C C C C O O C C C C F C F C F F F C C C C F C F C F F F C C C C F C F C F F F F F F F C C C C C C C C C C C C
charge: 0.274710 -0.252634 -0.022661 0.152626 -0.090346 0.311835 0.343766 -0.429043 -0.278592 0.750697 -0.084303 -0.074400 -0.087540 0.032199 0.039003 0.001041 0.017360 0.027789 0.056793 0.041355 -0.008548 0.040876 0.027858 0.001908 0.049590 0.477674 0.237779 -0.193491 -0.302041 -0.138605 0.124016 0.135005 0.221148 -0.200519 0.208870 -0.197801 0.109352 -0.188060 -0.191740 -0.188139 -0.073589 0.133268 0.095981 0.240733 -0.197625 0.220154 -0.200732 0.112564 -0.193229 -0.189995 -0.185081 -0.155071 0.147456 0.133134 0.229667 -0.202754 0.219055 -0.200452 0.095589 -0.191714 -0.193632 -0.190431 -0.162249 -0.170806 -0.173124 -0.188320 0.240934 -0.009826 -0.036400 0.014908 0.017779 0.030735 0.238524 -0.028343 -0.024731 0.011527 -0.001759 0.033071
chargesum: 0.00000
1716.lowfreq: -473.0704 0.0007 0.0012 0.0013 2.3168 4.3208 5.5536 11.1998 13.6954
redmass: 12.0887 9.1520 7.2755 7.3976 12.1488 8.6428 9.3233 10.1205 6.4028 6.8459 13.2277 6.0105 8.7761 11.7925 6.0308 5.7987 7.1892 8.6362 6.6527 6.3401 10.6120 7.5114 6.7614 6.3415 4.5974 6.3119 5.4996 7.2041 5.3611 5.8357 7.2580 13.5952 11.9032 12.6204 5.9729 4.1421 7.9535 5.1998 4.7516 13.8796 12.6284 3.2075 2.4977 12.0489 1.8093 7.3083 1.2458 4.1961 16.6887 18.0660 8.4123 3.2711 3.2997 9.0558 4.2420 2.5757 4.0277 3.8422 5.7317 13.8044 3.1617 11.6611 3.2295 6.4823 10.6539 7.2932 7.3584 17.1961 8.3896 11.8811 17.6197 6.8163 18.0181 18.2319 16.9163 8.0073 5.3414 10.8809 14.9895 16.0831 15.7917 14.5993 10.7502 9.2892 16.8505 17.2767 16.9524 6.3335 12.4288 6.7847 6.7248 4.1916 12.6415 7.7060 8.6976 3.1278 6.3242 3.0571 3.3824 15.8023 15.7153 14.6821 5.4060 13.1669 8.7517 15.3600 15.2410 5.2299 4.7935 16.0260 3.4649 10.3782 6.3997 5.2640 15.7332 16.2610 14.2299 9.0916 14.2236 13.1341 6.8769 12.1816 7.3569 6.4283 6.4746 6.6073 5.8838 12.6646 5.8776 4.4601 12.0491 8.9176 12.2109 12.2048 12.1117 8.6921 12.2076 3.2240 1.2819 1.6452 2.2440 1.7683 1.9655 1.6830 1.9425 9.5232 12.5464 8.9551 6.1103 11.4386 1.9549 5.5347 1.6983 1.8649 12.1386 1.6988 12.6490 2.2503 4.1425 2.2613 6.7143 12.4516 5.6574 1.5127 1.3248 1.2444 1.4823 1.5517 3.2348 1.6961 1.3874 2.3134 2.2904 2.6509 3.2774 3.1898 1.4400 2.7580 5.3892 6.0983 1.3585 1.6822 4.6037 5.1292 4.9371 4.8189 5.5763 3.4470 2.3912 1.4966 1.3345 1.3276 1.4303 2.0121 2.0403 2.0163 1.4402 2.2108 7.0297 1.4181 1.4012 1.5602 1.8457 12.9940 2.4217 12.7841 12.8965 5.3272 7.1148 1.0998 2.0254 1.8752 8.6270 1.3582 1.1668 1.2129 1.3822 2.0810 2.3456 1.6332 1.1814 3.9478 6.3370 6.0922 1.3228 1.2862 1.3081 7.2981 12.2109 12.4160 12.6838 11.9242 1.4461 9.8249 1.7812 9.7294 2.7844 1.8493 1.4893 5.3480 5.7724 4.7399 5.3824 1.0539 1.0521 1.0521 4.2807 3.7371 1.3637 12.1198 1.0608 4.8066 1.2391 4.4708 6.0713 2.4476 2.5108 2.8595 2.4756 11.9365 11.7805 11.0029 2.5506 2.5998 2.6829 2.9287 12.4393 12.3984 12.4101 5.9837 5.9999 7.3256 6.3345 6.3846 6.1324 6.1862 6.8953 11.9853 12.0297 10.1354 12.0221 12.0368 12.0318 12.0349 12.0359 13.0852 1.0375 1.0377 1.0411 1.1023 1.1025 1.0989 1.1041 1.1041 1.1039 1.0870 1.0879 1.0873 1.0885 1.0915 1.0911 1.0941 1.0918 1.0959 1.0954 1.0954 1.0996 1.0977 1.0977 1.0947 1.0947 1.0957 1.0979 1.0957 1.0932
irintensity: 2626.4502 0.4712 0.7457 0.0793 0.3871 0.8923 0.5040 0.2989 0.0893 2.2143 0.1058 0.2804 1.7760 0.0264 0.2687 0.8962 0.8532 0.1145 0.6676 0.8686 2.9259 0.2071 1.0537 0.6368 1.5584 0.6533 2.3371 1.8887 1.5958 2.8187 3.8121 1.2803 0.6797 1.1409 0.4948 1.9975 0.3237 0.7253 2.6180 0.1956 0.4061 0.7617 1.7635 0.1263 1.3175 0.8911 0.9479 0.4204 0.0982 0.0630 0.7699 1.2361 0.2537 4.5034 1.3237 2.7511 2.2666 10.0122 2.0558 6.6635 2.3485 6.3520 26.8298 9.3722 2.5339 0.7650 2.5943 0.1492 2.2806 2.4568 0.4091 21.5151 0.2407 0.1529 1.4191 0.1069 31.4061 3.8330 0.8495 1.9594 1.9063 4.2110 1.9168 3.1801 7.8828 7.4283 1.7964 8.6230 0.9974 2.5109 6.8223 0.0996 0.1913 4.4779 2.0353 0.4473 1.3071 0.4664 1.6171 0.1877 0.1066 1.9505 19.5228 4.1990 48.6580 3.9542 4.2210 13.2463 24.7110 0.5127 7.6032 18.1740 45.9736 18.3384 1.6875 0.4324 2.7283 15.4262 0.4694 1.2473 66.3416 0.4146 30.2263 4.0388 1.5804 0.6399 2.1070 48.9349 9.2637 37.5642 88.9821 9.1743 0.0583 1.7129 0.3189 16.4051 1.4030 35.9779 12.4710 51.8580 41.7742 9.7879 52.4935 119.9829 21.5001 87.9995 89.6793 2.7267 16.1482 18.7981 35.0826 44.2526 17.3216 51.5313 50.9422 60.6810 55.0099 11.2828 2.9781 62.3639 8.9950 33.6170 7.9660 340.0897 47.2585 2.5952 120.3091 51.2855 96.7107 110.3633 26.6452 74.8058 40.8404 166.5112 15.9027 105.9435 8.4823 29.8528 143.2943 158.0342 0.3867 21.5098 177.5029 201.6483 112.5419 43.2162 3.6718 14.9079 3.0684 10.1354 0.4044 0.0080 1.1863 3.3141 7.4131 8.0458 4.8086 12.0168 165.8521 15.3610 14.9832 6.0021 18.3630 61.4975 73.1959 426.5729 489.2749 271.0172 8.1151 0.5705 12.2418 7.4650 2.4264 45.5465 7.7420 1.8249 38.0486 106.7531 278.0037 32.9932 10.4003 113.5800 512.7155 1350.2212 59.8120 74.3150 77.9764 216.3728 9.3746 68.6948 75.3040 11.0165 2.6041 3.1170 41.2329 16.0218 256.9144 110.3757 2.6850 2.2075 41.8045 4.9676 31.5062 0.2205 3.1706 1.2040 282.2052 29.5072 51.6618 60.0785 15.9640 5.0522 55.6408 1125.5342 632.8513 3.3689 1.2380 92.9430 11.7143 617.0229 500.9310 1059.1610 144.5464 184.9537 9.2539 170.5760 225.6208 200.3335 129.8602 2.9862 2.4782 253.7422 39.1866 164.9356 78.9219 53.9844 11.2478 32.5206 5.9661 755.4528 9.2403 81.2247 72.4348 63.7515 426.9179 313.9236 1.0094 1.0518 1.1299 1.3876 0.5269 3.5002 2.9192 2.1080 0.8287 0.3128 2.2174 0.7271 1.2098 6.8578 2.8833 14.6137 2.9833 18.9172 4.2661 4.1882 7.9797 3.1180 7.0888 4.6819 1.5406 1.1902 9.3163 6.5715 10.1498
temp: 298.150 k
press: 1.00000 atm
elementType: 5 9 6 6 6 6 6 8 8 14 6 1 1 1 6 1 1 1 6 1 1 1 6 6 6 6 1 6 1 6 1 1 1 6 6 6 6 1 6 1 6 1 1 1 6 6 8 8 6 6 6 6 9 6 9 6 9 9 9 6 6 6 6 9 6 9 6 9 9 9 6 6 6 6 9 6 9 6 9 9 9 9 9 9 9 6 6 6 6 1 6 1 6 1 1 1 6 6 6 6 1 6 1 6 1 1 1
symmnumber: 1
zpe: 1870126.2 jmol-1
zpe.correction: 0.712293 hartree
zpe.thermalcorrener: 0.784482 hartree
zpe.thermalcorrenthalpy: 0.785426 hartree
zpe.thermalcorrgfe: 0.596705 hartree
zpe.sumelectzpe: -4605.629364 hartree
zpe.sumelectthermal: -4605.557175 hartree
zpe.sumelectthermalent: -4605.556231 hartree
zpe.sumelectthermalfe: -4605.744953 hartree
dipole: 16.5976 -5.4542 -6.4306
dipole: 18.6167
quadrupole: -428.0309 -460.9174 -378.3620
quadrupole: 34.9199 -43.2474 -3.1571
quadrupole: -5.5941 -38.4807 44.0748 34.9199 -43.2474 -3.1571
hfenergy: -4606.3416573 hartree
pointgroup: C01 [X(C52H29B1F20O4Si1)]
dipole: 6.5299962 -2.1458629 -2.5300098 debye
polarizability: 642.197226|-3.1950358|760.5189893|-47.0605407|3.0057665|863.336856 unknown
InChI: InChI=1S/C23H15F2O2.C18BF16.C11H14F2O2Si/c24-23(25,22(26)27-18-14-8-3-9-15-18)21-19(16-10-4-1-5-11-16)20(21)17-12-6-2-7-13-17;20-4-1(5(21)11(27)16(32)10(4)26)19(35,2-6(22)12(28)17(33)13(29)7(2)23)3-8(24)14(30)18(34)15(31)9(3)25;1-16(2,3)15-11(10(12)13)14-9-7-5-4-6-8-9/h1-15H;;4-8H,1-3H3
charge 0 multiplicity 1
107 atoms
B  -1.70221421 1.6772871 -0.13303384
F  -0.31181756 1.86455069 -0.46680644
C  2.54435087 -2.62052201 0.26838622
C  2.33886301 -1.35771388 0.67872436
C  2.26450677 -1.66425809 -0.70640664
C  4.37551633 -1.01588991 -1.274613
C  4.26196069 -1.01586291 -2.65302556
O  3.78574062 -0.03237996 -3.32605977
O  4.43364466 -2.18628243 -3.25257208
Si 4.03808589 1.70224756 -3.50052944
C  2.95630223 2.61761364 -2.29164666
H  3.11248059 2.27012112 -1.25753333
H  3.23527277 3.6870908 -2.32793135
H  1.88346259 2.54728528 -2.53352018
C  3.53371452 1.96594707 -5.27006667
H  3.62244634 3.0333768 -5.53957981
H  4.16410599 1.37823203 -5.95926217
H  2.48239622 1.66138693 -5.41574917
C  5.8521057 1.96529752 -3.15579344
H  6.09889539 3.03532911 -3.27817383
H  6.10491545 1.67875143 -2.1201079
H  6.49393148 1.39193599 -3.84684683
C  2.21739987 -0.43552403 1.7681348
C  1.9760388 0.9261846 1.53087483
C  2.31979431 -0.92342104 3.08307987
C  1.85074716 1.79558037 2.6063998
H  1.85876596 1.29657758 0.51189159
C  2.16892429 -0.04947354 4.15288382
H  2.50400996 -1.98685609 3.25276618
C  1.93745298 1.30808887 3.91288732
H  1.66271522 2.85598063 2.42659784
H  2.2323879 -0.42372797 5.17740287
H  1.8103642 1.9948823 4.7546229
C  1.48378658 -1.491352 -1.91366096
C  1.24838582 -2.60118397 -2.74052119
C  0.95557222 -0.23947981 -2.24700868
C  0.47270821 -2.45328241 -3.88373187
H  1.65198581 -3.57859868 -2.46456519
C  0.18268113 -0.09681403 -3.39519352
H  1.090651 0.61003223 -1.5777064
C  -0.05626724 -1.20111421 -4.21297045
H  0.26921253 -3.3183386 -4.51958337
H  -0.24898069 0.87797821 -3.63500939
H  -0.67277898 -1.09203594 -5.10936215
C  2.67991261 -4.05648447 0.62896325
C  1.32442773 -4.63727161 1.11424211
O  0.81401168 -5.60017115 0.63541023
O  0.88411132 -3.88393204 2.11492191
C  -1.77488267 1.75217376 1.51828907
C  -2.32981812 0.8136313 2.38318393
C  -1.15838929 2.83146657 2.1477994
C  -2.23544852 0.89491515 3.77097359
F  -2.99304074 -0.24982994 1.91259225
C  -1.04278319 2.95650417 3.52918956
F  -0.59827958 3.80728154 1.42643582
C  -1.57744885 1.97284429 4.35072601
F  -2.76576034 -0.04761482 4.5449559
F  -0.37952346 3.97755891 4.06509894
F  -1.45295475 2.05734418 5.66805164
C  -2.12014401 0.20530634 -0.75642283
C  -1.38952753 -0.91041993 -0.35924931
C  -3.04593861 -0.04480921 -1.76437705
C  -1.53952187 -2.18085555 -0.8924493
F  -0.44763588 -0.78279355 0.58750203
C  -3.22612883 -1.30340663 -2.3446181
F  -3.81980748 0.92445253 -2.25856159
C  -2.46150528 -2.37876531 -1.91368102
F  -0.78212633 -3.1924415 -0.47061879
F  -4.11006038 -1.47391986 -3.32145659
F  -2.59808015 -3.57166223 -2.47205468
C  -2.57895558 2.90819307 -0.78101344
C  -3.83607106 3.24737362 -0.28784711
C  -2.13968305 3.67247486 -1.85898914
C  -4.60612952 4.29241607 -0.78962009
F  -4.38389441 2.53086577 0.70037131
C  -2.87577549 4.72965614 -2.39323084
F  -0.97946512 3.41106973 -2.46984854
C  -4.11592665 5.04538382 -1.85119494
F  -5.7993307 4.57111608 -0.27546241
F  -2.40745786 5.43177239 -3.4205198
F  -4.82994712 6.04651239 -2.34890647
F  5.03140779 -1.97064865 -0.63746396
F  4.4248971 0.13500653 -0.60858963
F  3.09991826 -4.76375267 -0.42559372
F  3.58000935 -4.19392372 1.62514516
C  4.43855454 -2.2841315 -4.64071713
C  3.64099657 -3.26670347 -5.21518239
C  5.27401025 -1.4803797 -5.41217017
C  3.66019591 -3.42809994 -6.60053373
H  3.02010043 -3.89945994 -4.57957723
C  5.27799388 -1.64555838 -6.79616744
H  5.92534955 -0.74271716 -4.93868479
C  4.46886697 -2.61368191 -7.3936741
H  3.03442496 -4.19780157 -7.0599183
H  5.9269993 -1.0145962 -7.40915352
H  4.47703067 -2.73977459 -8.47936896
C  -0.34744938 -4.13285289 2.72504735
C  -0.62488378 -5.36601186 3.30455557
C  -1.24613931 -3.07376386 2.7721843
C  -1.85447393 -5.53831427 3.94101239
H  0.10390737 -6.1777302 3.262723
C  -2.47004155 -3.26029258 3.41312412
H  -0.98657479 -2.12163352 2.30744747
C  -2.77618681 -4.49130686 3.99527597
H  -2.08950842 -6.50231608 4.40015027
H  -3.18091547 -2.43261823 3.45426521
H  -3.73719578 -4.63524697 4.49615719
