program: Gaussian 09
title: 000007137
version: EM64L-G09RevD.01
frameworkgroup: C1[X(C12H14O3)]
method: RPBEPBE
basis: SDD
operation: Freq
keyword: #pfreq=noraman
keyword: PBEPBE/SDD
title: #p freq=noraman PBEPBE/SDD
converged: YES YES NO NO
title: Mulliken charges:
elementType: O O O C C C C C C C C C C C C H H H H H H H H H H H H H H
charge: -0.288843 -0.307854 -0.200928 0.581341 0.180176 0.257251 -0.523232 -0.437724 -0.312045 -0.333851 -0.154672 0.251614 -0.524739 -0.742349 -0.750113 0.248417 0.231660 0.256826 0.225421 0.215737 0.249183 0.216893 0.231747 0.225021 0.227115 0.224056 0.254691 0.249873 0.249329
chargesum: 0.00000
title: Mulliken charges with hydrogens summed into heavy atoms:
elementType: O O O C C C C C C C C C C C C
charge: -0.288843 -0.307854 -0.200928 0.581341 0.180176 0.257251 -0.274815 -0.206064 -0.055219 -0.108430 0.061065 0.251614 0.173083 -0.066157 0.003779
polarizability: 2.45092849e+02 2.49745325e+00 1.41303432e+02 6.69551804e+00 7.36773041e+00 8.09650522e+01
1716.lowfreq: -5.7679 -2.8820 0.0004 0.0005 0.0006 6.4111 25.6496 39.6272 58.7386
frequency: 25.4703 39.6107 58.7295 73.8817 79.1777 86.4221 117.8500 128.5361 148.7831 179.8771 187.9170 223.1449 256.7934 279.4839 317.5785 328.3952 386.9599 409.3539 457.3312 470.9764 539.8144 546.0661 566.2302 624.0321 650.5608 705.4679 728.2647 749.3415 798.2242 841.6782 862.2415 889.6179 896.8608 945.4713 948.3071 982.9560 987.4585 1000.0624 1039.1344 1042.4551 1090.7888 1111.1482 1112.3648 1154.2566 1159.5544 1166.4953 1192.9231 1243.3511 1260.3757 1304.5487 1316.2541 1375.8849 1382.3507 1395.0179 1407.1614 1441.8991 1452.8922 1453.9638 1458.2475 1460.0063 1470.4446 1482.1744 1485.5702 1574.8988 1608.9179 1671.2711 1680.2147 2962.0867 2973.5293 3007.9572 3033.6426 3072.9358 3076.8791 3083.1869 3096.7677 3098.4502 3123.5751 3135.5495 3144.4825 3160.1228 3179.8275
redmass: 5.8147 2.9336 1.6923 1.9928 1.7803 2.9553 2.9108 2.4663 1.9960 1.4646 1.5170 4.9250 4.1909 4.4031 3.5019 4.2893 4.3929 4.4410 3.5854 3.8255 3.7508 4.4942 4.3662 4.2533 4.5889 4.2070 4.7193 3.5701 1.5067 1.7363 4.0214 2.6874 2.2209 1.3649 2.0764 1.1446 2.1054 2.9334 1.6438 1.5448 3.5260 1.2744 2.3255 1.3585 1.9531 2.7351 1.8050 2.5505 1.3079 1.4052 1.7863 4.4963 1.2941 1.2603 2.1561 1.4821 1.0572 1.0479 1.0577 1.0476 1.0933 1.0722 2.6371 7.3783 6.6092 5.7042 10.1463 1.0368 1.0335 1.0369 1.0966 1.0949 1.0995 1.0923 1.0973 1.0905 1.1035 1.0899 1.1011 1.0909 1.0951
irintensity: 0.5685 3.2743 1.1593 4.7597 2.7695 1.3035 0.1819 0.8924 2.8256 2.0269 2.0178 2.1122 4.9507 1.9076 4.0640 3.1787 0.6385 4.6518 6.3637 2.9401 0.7836 2.4138 5.2028 1.1110 12.3142 5.1301 10.6939 8.1538 35.6720 13.7638 83.5404 14.3887 15.2087 3.7904 48.1272 55.6474 111.4788 50.0696 9.1134 1.0405 126.7170 4.8225 41.2811 0.9566 196.6067 329.9263 6.6798 87.4238 0.5058 11.2111 20.9467 21.7186 46.9485 8.7757 27.0075 17.7779 23.4175 19.0050 11.2510 14.6962 17.1469 6.1566 102.4688 28.1396 27.3699 18.4339 177.6513 51.9865 79.0190 1.6048 25.1149 7.4441 35.2005 8.8877 6.2650 58.5133 21.1040 14.9118 11.4245 4.4934 4.2505
temp: 298.150 k
press: 1.00000 atm
elementType: 8 8 8 6 6 6 6 6 6 6 6 6 6 6 6 1 1 1 1 1 1 1 1 1 1 1 1 1 1
symmnumber: 1
zpe: 602095.4 jmol-1
zpe.correction: 0.229326 hartree
zpe.thermalcorrener: 0.245632 hartree
zpe.thermalcorrenthalpy: 0.246576 hartree
zpe.thermalcorrgfe: 0.183785 hartree
zpe.sumelectzpe: -690.204456 hartree
zpe.sumelectthermal: -690.188149 hartree
zpe.sumelectthermalent: -690.187205 hartree
zpe.sumelectthermalfe: -690.249996 hartree
dipole: -0.3219 1.5915 -2.2369
dipole: 2.7641
quadrupole: -65.7399 -85.8096 -93.3250
quadrupole: -6.2429 4.7149 2.5592
quadrupole: 15.8850 -4.1848 -11.7002 -6.2429 4.7149 2.5592
hfenergy: -690.4337817 hartree
pointgroup: C01 [X(C12H14O3)]
dipole: -0.0990358 0.537135 -0.9403731 debye
polarizability: 244.7048169|2.3597325|142.1223471|10.5751802|1.3112392|80.534169 unknown
InChI: InChI=1S/C12H14O3/c1-4-5-10-6-7-11(15-9(2)13)12(8-10)14-3/h4-8H,1-3H3
charge 0 multiplicity 1
29 atoms
O  -0.649812 2.257775 0.294622
O  -2.361404 0.07648 -0.396809
O  -2.971713 -1.737937 0.978542
C  1.868731 -0.465586 -0.077912
C  -0.13304 0.978378 0.010746
C  -0.953801 -0.14781 -0.281886
C  1.261007 0.806267 0.109916
C  1.023491 -1.566996 -0.390481
C  -0.372838 -1.413205 -0.492621
C  3.324701 -0.69159 0.027741
C  4.28277 0.226609 0.34244
C  -3.294279 -0.760354 0.282333
C  -1.436284 2.907806 -0.77491
C  5.758836 -0.073705 0.438742
C  -4.691269 -0.250268 0.010936
H  1.854864 1.694946 0.344387
H  1.466706 -2.557201 -0.546253
H  -1.011306 -2.272477 -0.712148
H  3.650573 -1.724241 -0.168918
H  3.990633 1.266754 0.55109
H  -2.334191 2.318127 -1.025769
H  -0.812073 3.048131 -1.678711
H  -1.72255 3.887669 -0.363453
H  6.342233 0.555454 -0.262419
H  6.145118 0.145044 1.454035
H  5.974603 -1.132318 0.210452
H  -4.811797 0.758581 0.443497
H  -5.427938 -0.932374 0.458711
H  -4.864772 -0.167058 -1.075401
