program: Gaussian 16
title: Template file
version: ES64L-G16RevC.01
basis: def2SVP
method: RB3LYP
operation: Freq
keyword: #
keyword: freq
keyword: b3lyp/def2svp
keyword: scrf=(cpcm,solvent=chloroform)
keyword: guess=read
keyword: em=gd3bj
title: # freq b3lyp/def2svp scrf=(cpcm,solvent=chloroform) guess=read em=gd3b
nucrepener: 42908.4961709556
converged: YES YES NO YES
title: Mulliken charges:
elementType: P N P N S O O O C C C C C C C C C C C C H H H C C C C C C H C C C C C C H H O N S O O O C C C C C C C C C C C C H H H C C C C C C H C C C C C C H H O H H H H H H H H C C C C C C C C C C C C C C C C C C C C F F F F F F F F F F F F F F C C H H H C H H H C H H H C C H H H C H H H C H H H C C H H H C H H H C H H H C C H H H C H H H C H H H C C C C H H H H C C C C H H H H C C C C H H H H C C C C H H H H C C H H H C H H C C C C H H C H H H H H H C H H C H H C H H C H H H H
charge: 1.084078 -0.474767 1.069662 -0.550643 0.962837 -0.469818 -0.467339 -0.436237 0.046639 0.047532 0.035751 0.082979 -0.117724 0.132131 0.073184 -0.036028 -0.042907 0.091202 -0.030125 -0.040150 -0.024699 0.008157 -0.019521 0.061201 0.057588 0.139428 -0.118762 0.074234 0.044272 -0.018758 0.060921 -0.035063 -0.048936 0.105276 -0.045166 -0.009888 -0.018939 -0.020257 -0.449568 -0.535705 0.937882 -0.392841 -0.344601 -0.428689 0.051205 0.044783 0.033837 0.075868 -0.119409 0.134500 0.073090 -0.036337 -0.051169 0.097967 -0.036253 -0.043451 -0.033270 0.007960 -0.014169 0.058462 0.057018 0.134568 -0.111632 0.074159 0.050723 -0.015684 0.058460 -0.007780 -0.048336 0.105668 -0.044898 -0.025064 -0.018986 -0.029647 -0.460866 -0.001905 -0.026842 -0.021317 -0.015670 -0.019961 -0.007123 -0.020155 -0.012735 -0.220847 0.248398 0.238016 -0.005296 0.174541 -0.016906 0.185722 0.171055 0.173556 0.193423 -0.235029 0.220744 0.234736 -0.013097 0.197163 -0.029811 0.163484 0.176280 0.170371 0.172036 -0.164319 -0.162102 -0.170024 -0.163921 -0.148937 -0.174070 -0.154269 -0.142222 -0.161261 -0.161423 -0.154446 -0.156033 -0.157568 -0.142293 -0.264618 0.083081 0.004170 0.003913 0.006901 0.069185 0.009389 0.010557 0.003439 0.088550 0.009992 0.009433 0.006163 -0.256625 0.091885 0.003272 0.002443 0.009579 0.081709 0.000190 0.002131 0.003653 0.084821 0.005356 0.003944 0.005536 -0.259639 0.088897 -0.000323 0.012381 0.008740 0.084346 0.003054 0.005800 0.002857 0.074485 -0.004022 0.016717 -0.001496 -0.261379 0.076651 -0.000788 -0.005421 0.016114 0.083160 0.004039 0.003650 0.005156 0.088609 0.000695 0.011550 0.007935 -0.033988 0.021996 0.018358 -0.047220 0.019177 -0.013459 -0.003756 -0.002181 -0.045679 0.017444 0.023604 -0.039130 -0.014009 -0.001027 -0.002414 0.001244 -0.031503 0.024401 0.018418 -0.042069 0.019150 -0.011069 -0.001917 -0.000048 -0.049217 0.027778 0.024361 -0.055033 -0.003515 0.000624 0.001607 0.000890 -0.205998 0.101240 0.026806 0.013227 0.027543 0.081275 -0.014084 -0.014804 -0.187649 0.078044 -0.173959 0.034711 -0.019026 -0.002293 0.112616 0.019593 0.259568 -0.003696 -0.012123 0.018779 0.013948 0.112762 0.003419 -0.006758 0.006003 0.001941 -0.004995 -0.017135 -0.006326 -0.000800 0.018009 0.004934 0.007114 0.007128 0.000272
chargesum: -0.00000
title: Mulliken charges with hydrogens summed into heavy atoms:
elementType: P N P N S O O O C C C C C C C C C C C C C C C C C C C C C C C C O N S O O O C C C C C C C C C C C C C C C C C C C C C C C C O C C C C C C C C C C C C C C C C C C C C F F F F F F F F F F F F F F C C C C C C C C C C C C C C C C C C C C C C C C C C C C C C C C C C C C C C C C C C C C
charge: 1.084078 -0.474767 1.069662 -0.550643 0.962837 -0.469818 -0.467339 -0.436237 0.046639 0.047532 0.035751 0.082979 -0.137245 0.132131 0.073184 -0.027871 -0.050030 0.091202 -0.050086 -0.064849 0.061201 0.057588 0.139428 -0.137520 0.074234 0.044272 0.060921 -0.055320 -0.064606 0.105276 -0.066483 -0.028827 -0.449568 -0.535705 0.937882 -0.392841 -0.085033 -0.428689 0.051205 0.044783 0.033837 0.075868 -0.133577 0.134500 0.073090 -0.028377 -0.053074 0.097967 -0.063095 -0.076721 0.058462 0.057018 0.134568 -0.127316 0.074159 0.050723 0.058460 -0.037427 -0.068491 0.105668 -0.057633 -0.044050 -0.460866 -0.220847 0.248398 0.238016 -0.005296 0.174541 -0.016906 0.185722 0.171055 0.173556 0.193423 -0.235029 0.220744 0.234736 -0.013097 0.197163 -0.029811 0.163484 0.176280 0.170371 0.172036 -0.164319 -0.162102 -0.170024 -0.163921 -0.148937 -0.174070 -0.154269 -0.142222 -0.161261 -0.161423 -0.154446 -0.156033 -0.157568 -0.142293 -0.264618 0.098064 0.092569 0.114138 -0.256625 0.107179 0.087682 0.099657 -0.259639 0.109695 0.096056 0.085683 -0.261379 0.086557 0.096004 0.108788 -0.047447 0.019815 0.014602 -0.028042 -0.046706 0.018688 0.021190 -0.053139 -0.042572 0.024353 0.016500 -0.022920 -0.048593 0.028668 0.025968 -0.058549 -0.205998 0.168816 0.052387 -0.187649 0.056725 -0.154366 0.018892 0.145343 0.109695 0.002949 -0.024261 0.037185
chargesum: -0.00009
1716.lowfreq: -0.0053 -0.0048 -0.0043 1.2457 2.0897 2.4893 11.9327 15.8374 18.0962
temp: 298.150 k
press: 1.00000 atm
elementType: 15 7 15 7 16 8 8 8 6 6 6 6 6 6 6 6 6 6 6 6 1 1 1 6 6 6 6 6 6 1 6 6 6 6 6 6 1 1 8 7 16 8 8 8 6 6 6 6 6 6 6 6 6 6 6 6 1 1 1 6 6 6 6 6 6 1 6 6 6 6 6 6 1 1 8 1 1 1 1 1 1 1 1 6 6 6 6 6 6 6 6 6 6 6 6 6 6 6 6 6 6 6 6 9 9 9 9 9 9 9 9 9 9 9 9 9 9 6 6 1 1 1 6 1 1 1 6 1 1 1 6 6 1 1 1 6 1 1 1 6 1 1 1 6 6 1 1 1 6 1 1 1 6 1 1 1 6 6 1 1 1 6 1 1 1 6 1 1 1 6 6 6 6 1 1 1 1 6 6 6 6 1 1 1 1 6 6 6 6 1 1 1 1 6 6 6 6 1 1 1 1 6 6 1 1 1 6 1 1 6 6 6 6 1 1 6 1 1 1 1 1 1 6 1 1 6 1 1 6 1 1 6 1 1 1 1
symmnumber: 1
zpe: 4811143.5 jmol-1
zpe.correction: 1.832468 hartree
zpe.thermalcorrener: 1.958169 hartree
zpe.thermalcorrenthalpy: 1.959113 hartree
zpe.thermalcorrgfe: 1.670112 hartree
zpe.sumelectzpe: -7961.777420 hartree
zpe.sumelectthermal: -7961.651719 hartree
zpe.sumelectthermalent: -7961.650774 hartree
zpe.sumelectthermalfe: -7961.939775 hartree
dipole: -6.8770 -4.7552 3.7064
dipole: 9.1456
quadrupole: -770.2536 -797.4170 -851.3311
quadrupole: -9.8273 16.8526 15.4358
quadrupole: 36.0803 8.9169 -44.9972 -9.8273 16.8526 15.4358
hfenergy: -7963.6098875 hartree
pointgroup: C01 [X(C112H95F14N3O8P2S2)]
dipole: -2.7056254 -1.8708291 1.4582146 debye
polarizability: 2110.7256117|-12.0488609|1771.4451854|131.2211496|29.2020437|1545.7406609 unknown
InChI: InChI=1S/C100H73F14N3O8P2S2.C12H22/c1-97(2,3)57-37-29-49(30-38-57)65-45-53-21-13-17-25-61(53)69-70-62-26-18-14-22-54(62)46-66(50-31-39-58(40-32-50)98(4,5)6)92(70)123-126(122-91(65)69,116-128(118,119)95-83(107)75-73(81(105)89(95)113)77(101)85(109)87(111)79(75)103)115-127(117-129(120,121)96-84(108)76-74(82(106)90(96)114)78(102)86(110)88(112)80(76)104)124-93-67(51-33-41-59(42-34-51)99(7,8)9)47-55-23-15-19-27-63(55)71(93)72-64-28-20-16-24-56(64)48-68(94(72)125-127)52-35-43-60(44-36-52)100(10,11)12;1-4-5-9-12(3)10-7-6-8-11(12)2/h13-48,118H,1-12H3;8H,4-7,9-10H2,1-3H3
charge 0 multiplicity 1
236 atoms
P  -1.292483 -0.721496 0.246192
N  0.190984 -1.081926 -0.04131
P  1.550826 -0.288277 -0.184402
N  1.538598 1.274514 -0.453075
S  1.987613 1.991256 -1.818709
O  1.773805 3.437021 -1.698222
O  1.452701 1.333865 -3.020542
O  2.352029 -0.669015 1.181453
C  3.72049 -0.473993 1.264635
C  4.551921 -1.311908 0.531255
C  5.960943 -1.047421 0.539969
C  6.465042 -0.024252 1.40864
C  5.564753 0.732429 2.200392
C  4.192777 0.548436 2.140601
C  3.276255 1.306079 3.029311
C  2.142236 0.700456 3.603645
C  1.359608 1.378549 4.530697
C  1.657779 2.688536 4.93911
C  2.773297 3.299736 4.345942
C  3.560776 2.628459 3.406276
H  4.402655 3.149202 2.945961
H  1.872422 -0.319455 3.344798
H  5.977183 1.47105 2.889073
C  3.967268 -2.482597 -0.187152
C  2.925679 -2.296548 -1.081857
C  2.224677 -3.352133 -1.732953
C  2.646166 -4.640995 -1.453877
C  3.691856 -4.911886 -0.534202
C  4.364108 -3.828827 0.124848
H  2.151561 -5.483124 -1.941549
C  1.067454 -3.092977 -2.624593
C  -0.056213 -3.937845 -2.574763
C  -1.136794 -3.748958 -3.431873
C  -1.152893 -2.708136 -4.378073
C  -0.044621 -1.848094 -4.397408
C  1.043816 -2.029963 -3.541181
H  1.876915 -1.332117 -3.595256
H  -0.09684 -4.741118 -1.837513
O  2.494105 -0.99713 -1.306496
N  -1.650462 0.745615 0.837486
S  -2.195097 1.007316 2.269611
O  -1.512285 0.436596 3.41939
O  -2.304549 2.572146 2.391165
O  -2.103882 -0.995841 -1.123808
C  -3.481833 -1.149457 -1.164939
C  -4.033428 -2.287075 -0.588829
C  -5.461208 -2.423334 -0.585919
C  -6.241895 -1.477488 -1.326958
C  -5.603491 -0.381202 -1.959325
C  -4.235374 -0.166053 -1.875594
C  -3.595337 0.987539 -2.557936
C  -2.29407 0.924157 -3.097545
C  -1.73766 2.012795 -3.759817
C  -2.446446 3.211673 -3.942016
C  -3.747446 3.267589 -3.420779
C  -4.305199 2.187439 -2.73411
H  -5.299207 2.297334 -2.299322
H  -1.701437 0.018246 -3.01325
H  -6.217531 0.303137 -2.546149
C  -3.138227 -3.369132 -0.083482
C  -2.141562 -3.084695 0.835516
C  -1.178467 -4.024114 1.298873
C  -1.269987 -5.307383 0.788209
C  -2.241361 -5.668317 -0.179681
C  -3.190507 -4.695391 -0.639073
H  -0.562189 -6.067251 1.124513
C  -0.100236 -3.65192 2.246656
C  -0.332139 -2.851796 3.375778
C  0.692072 -2.590214 4.289375
C  1.986489 -3.103287 4.113844
C  2.219268 -3.867083 2.956196
C  1.203876 -4.136594 2.04369
H  1.432159 -4.714666 1.147173
H  -1.322209 -2.436751 3.557383
O  -2.018975 -1.762521 1.266577
H  -0.713703 1.913769 -4.120961
H  -4.340583 4.1766 -3.515781
H  -0.008416 -1.011779 -5.094638
H  -1.98426 -4.430876 -3.353228
H  3.042042 4.323276 4.605259
H  0.494843 0.859637 4.94293
H  0.457034 -1.976304 5.158353
H  3.213954 -4.264907 2.754444
C  -3.914485 0.510011 2.293357
C  -4.809239 1.134811 1.441592
C  -4.342651 -0.624426 3.02976
C  -6.15827 0.721137 1.327083
C  -5.635843 -1.083629 2.910077
C  -6.582883 -0.426296 2.084288
C  -7.0953 1.374042 0.482561
C  -7.927001 -0.858544 1.964406
C  -8.393525 0.927152 0.393877
C  -8.81008 -0.193176 1.143406
C  3.793444 1.772382 -1.804121
C  4.479765 0.969907 -2.692799
C  4.531447 2.451131 -0.801789
C  5.898096 0.835573 -2.650316
C  5.901617 2.376154 -0.742301
C  6.63221 1.594422 -1.67288
C  6.620231 -0.009289 -3.535751
C  8.046092 1.514417 -1.665588
C  7.995243 -0.086977 -3.476878
C  8.7115 0.685399 -2.540871
F  8.665323 -0.898894 -4.288142
F  10.033183 0.569779 -2.485973
F  8.76748 2.216653 -0.794119
F  5.994943 -0.758934 -4.440207
F  3.829752 0.283703 -3.625602
F  6.531305 3.033223 0.234151
F  3.903147 3.164223 0.128962
F  -3.516391 -1.285649 3.8262
F  -5.980089 -2.172369 3.592795
F  -8.362782 -1.934048 2.612547
F  -10.051915 -0.630493 0.999907
F  -9.259207 1.509752 -0.424885
F  -6.73904 2.419312 -0.260623
F  -4.386728 2.141579 0.687545
C  -1.775593 4.380119 -4.673612
C  -1.463517 3.948782 -6.122712
H  -2.386611 3.679688 -6.660309
H  -0.974346 4.771151 -6.669476
H  -0.7901 3.079165 -6.147443
C  -0.458934 4.737032 -3.953094
H  0.044228 5.570595 -4.469312
H  -0.647372 5.044443 -2.914359
H  0.239606 3.891168 -3.910773
C  -2.67219 5.625909 -4.717039
H  -2.919627 5.985382 -3.706826
H  -2.152273 6.44207 -5.24091
H  -3.61485 5.433136 -5.252077
C  0.797653 3.353279 6.023121
C  1.177322 4.824905 6.246969
H  1.059597 5.420038 5.329574
H  0.526021 5.263355 7.01875
H  2.21704 4.930131 6.592753
C  -0.694764 3.280379 5.636572
H  -1.312906 3.739772 6.424278
H  -0.887386 3.81586 4.696162
H  -1.038573 2.246512 5.494873
C  1.012712 2.585362 7.346497
H  2.071261 2.615607 7.649206
H  0.410817 3.033802 8.153653
H  0.7184 1.529353 7.249811
C  -2.324462 -2.580936 -5.363017
C  -2.207272 -1.328693 -6.246034
H  -3.074544 -1.270817 -6.921851
H  -2.18883 -0.407781 -5.644275
H  -1.301229 -1.35082 -6.870601
C  -2.330109 -3.828272 -6.273553
H  -3.155311 -3.768164 -7.001831
H  -1.384284 -3.911133 -6.831776
H  -2.460742 -4.751645 -5.68887
C  -3.659314 -2.508546 -4.596753
H  -3.815552 -3.390974 -3.961337
H  -3.6966 -1.61987 -3.954117
H  -4.501876 -2.45093 -5.304364
C  3.113737 -2.902964 5.137937
C  4.350318 -2.284685 4.455567
H  5.172491 -2.182198 5.181771
H  4.712525 -2.905972 3.625125
H  4.125701 -1.287489 4.056057
C  3.493508 -4.283962 5.716057
H  3.853542 -4.964139 4.92927
H  4.294976 -4.178179 6.465164
H  2.627041 -4.757528 6.20405
C  2.691027 -1.986597 6.296684
H  3.531468 -1.86658 6.997629
H  2.407218 -0.985272 5.940765
H  1.844685 -2.405678 6.862319
C  4.053207 -6.251864 -0.21706
C  5.017538 -6.522155 0.729229
C  5.662944 -5.455128 1.400689
C  5.346546 -4.145291 1.104303
H  5.846414 -3.340515 1.639085
H  3.536283 -7.065585 -0.731496
H  6.413425 -5.66952 2.164753
H  5.279048 -7.554837 0.970248
C  6.877986 -1.747996 -0.290772
C  8.23082 -1.48862 -0.224488
C  8.734721 -0.513883 0.672013
C  7.867842 0.208736 1.461475
H  8.242294 0.989641 2.126615
H  6.498249 -2.491916 -0.99109
H  9.807339 -0.313272 0.706517
H  8.919366 -2.025796 -0.880478
C  -2.256889 -6.976974 -0.739599
C  -3.150234 -7.312491 -1.733147
C  -4.068631 -6.34521 -2.20906
C  -4.089935 -5.073479 -1.67475
H  -4.794815 -4.343356 -2.065479
H  -1.531335 -7.707583 -0.374232
H  -4.762211 -6.604403 -3.011931
H  -3.14587 -8.316808 -2.162202
C  -6.132484 -3.463304 0.113626
C  -7.501984 -3.603772 0.027638
C  -8.26688 -2.715272 -0.768111
C  -7.649929 -1.66862 -1.418336
H  -8.23693 -0.954706 -2.001276
H  -5.54969 -4.152133 0.725403
H  -9.349207 -2.840874 -0.834823
H  -8.001493 -4.402523 0.579256
C  -1.47609 6.00332 1.221983
C  -2.604876 4.356779 -0.461411
H  -2.53839 3.328771 -0.836278
H  -3.576655 4.476015 0.04206
H  -2.618461 5.023533 -1.335942
C  -2.003438 7.150357 0.323668
H  -2.071535 8.058906 0.94734
H  -3.040275 6.920055 0.027555
C  -1.450762 4.676463 0.450302
C  -0.054916 6.348574 1.720898
C  -0.422074 3.804491 0.564963
C  0.65234 5.172031 2.386087
H  -0.118421 7.208667 2.408508
H  0.555434 6.674249 0.863912
C  0.797582 4.003321 1.413835
H  -0.432567 2.897111 -0.043563
H  -1.757531 3.085975 1.687342
H  1.640496 5.480187 2.758513
H  0.086218 4.845413 3.270357
H  1.647824 4.150823 0.728015
H  1.029546 3.068318 1.948215
C  -2.440934 5.872045 2.421138
H  -2.524363 6.835889 2.948107
H  -2.097172 5.119835 3.144209
C  -1.183708 7.467103 -0.928714
H  -0.224529 7.931321 -0.645591
H  -0.916392 6.533653 -1.451796
C  -1.911498 8.395331 -1.902496
H  -2.228054 9.308888 -1.367253
H  -2.844275 7.907332 -2.238305
C  -1.064725 8.775938 -3.115474
H  -0.153927 9.317197 -2.809762
H  -0.74431 7.87981 -3.670061
H  -1.620406 9.421471 -3.81411
H  -3.450206 5.580075 2.092678
