program: Gaussian 16
title: Template file
version: ES64L-G16RevC.01
basis: def2SVP
method: RB3LYP
operation: Freq
keyword: #
keyword: freq
keyword: b3lyp/def2svp
keyword: scrf=(cpcm,solvent=chloroform)
keyword: guess=read
keyword: em=gd3bj
title: # freq b3lyp/def2svp scrf=(cpcm,solvent=chloroform) guess=read em=gd3b
nucrepener: 42984.4753742737
converged: YES YES NO YES
title: Mulliken charges:
elementType: P N P N S O O O C C C C C C C C C C C C H H H C C C C C C H C C C C C C H H O N S O O O C C C C C C C C C C C C H H H C C C C C C H C C C C C C H H O H H H H H H H H C C C C C C C C C C C C C C C C C C C C F F F F F F F F F F F F F F C C H H H C H H H C H H H C C H H H C H H H C H H H C C H H H C H H H C H H H C C H H H C H H H C H H H C C C C H H H H C C C C H H H H C C C C H H H H C C C C H H H H C C H H H C H H C C C C H H C H H H H H H C H H C H H C H H C H H H H
charge: 1.076098 -0.484869 1.069109 -0.563736 0.961416 -0.480256 -0.465216 -0.437290 0.048883 0.046158 0.036584 0.081220 -0.118135 0.132699 0.071344 -0.037030 -0.038265 0.089836 -0.037391 -0.040610 -0.025246 0.009572 -0.020005 0.057238 0.058000 0.138155 -0.117958 0.074407 0.047263 -0.019213 0.061452 -0.033354 -0.048457 0.105289 -0.047477 -0.008579 -0.020246 -0.020191 -0.449532 -0.563831 0.967525 -0.428601 -0.496048 -0.434929 0.058231 0.040028 0.039093 0.073943 -0.117357 0.130899 0.077008 -0.038619 -0.045880 0.090324 -0.039399 -0.046910 -0.032168 0.010434 -0.016959 0.056436 0.056953 0.135772 -0.114527 0.075277 0.049345 -0.017547 0.059614 -0.006019 -0.049090 0.105283 -0.046476 -0.029469 -0.019356 -0.025322 -0.454336 0.000682 -0.027126 -0.021687 -0.014628 -0.021175 -0.003992 -0.021340 -0.013268 -0.222468 0.239242 0.229198 -0.003830 0.169662 -0.019584 0.181784 0.170493 0.168250 0.190299 -0.231285 0.220253 0.234991 -0.014101 0.196930 -0.029541 0.163608 0.176785 0.170319 0.172822 -0.164141 -0.162027 -0.170033 -0.163714 -0.148124 -0.173964 -0.155558 -0.146276 -0.166006 -0.164055 -0.158418 -0.159967 -0.162045 -0.151334 -0.266340 0.083991 0.005038 0.004174 0.007483 0.076340 0.010943 -0.000130 0.004474 0.089021 0.008872 0.008796 0.007577 -0.255910 0.092116 -0.000178 0.002593 0.009744 0.079336 -0.000760 0.001827 0.004652 0.084434 0.005058 0.003877 0.006264 -0.259458 0.089001 -0.000622 0.012540 0.008032 0.083135 0.002607 0.005506 0.003238 0.075480 -0.004513 0.016252 -0.001984 -0.260636 0.076664 -0.001449 -0.005404 0.015849 0.082228 0.003854 0.002879 0.005142 0.089242 -0.000064 0.011635 0.007552 -0.033864 0.021928 0.016899 -0.045337 0.018828 -0.013612 -0.004067 -0.002508 -0.046017 0.018613 0.021230 -0.038234 -0.014357 -0.001355 -0.002637 0.001055 -0.032977 0.023195 0.016397 -0.040967 0.018678 -0.012435 -0.003263 -0.001479 -0.048889 0.027110 0.022262 -0.053149 -0.005430 -0.000970 -0.000274 -0.000616 -0.243378 0.098756 0.049370 0.037345 0.052370 0.078412 -0.000968 -0.005311 -0.145977 0.078591 -0.067490 0.016416 -0.005372 0.009208 0.102600 0.057091 0.240631 0.009028 0.004450 0.032016 0.027813 0.113494 0.017043 0.019282 0.001241 0.009140 -0.003593 -0.019587 -0.002999 0.002590 0.020361 0.006828 0.006837 0.009887 0.009494
chargesum: -0.00000
title: Mulliken charges with hydrogens summed into heavy atoms:
elementType: P N P N S O O O C C C C C C C C C C C C C C C C C C C C C C C C O N S O O O C C C C C C C C C C C C C C C C C C C C C C C C O C C C C C C C C C C C C C C C C C C C C F F F F F F F F F F F F F F C C C C C C C C C C C C C C C C C C C C C C C C C C C C C C C C C C C C C C C C C C C C
charge: 1.076098 -0.484869 1.069109 -0.563736 0.961416 -0.480256 -0.465216 -0.437290 0.048883 0.046158 0.036584 0.081220 -0.138140 0.132699 0.071344 -0.027458 -0.042256 0.089836 -0.058565 -0.065856 0.057238 0.058000 0.138155 -0.137171 0.074407 0.047263 0.061452 -0.053545 -0.063085 0.105289 -0.069164 -0.028824 -0.449532 -0.563831 0.967525 -0.428601 -0.496048 -0.434929 0.058231 0.040028 0.039093 0.073943 -0.134316 0.130899 0.077008 -0.028185 -0.045198 0.090324 -0.066525 -0.079078 0.056436 0.056953 0.135772 -0.132074 0.075277 0.049345 0.059614 -0.031340 -0.070430 0.105283 -0.059744 -0.048825 -0.454336 -0.222468 0.239242 0.229198 -0.003830 0.169662 -0.019584 0.181784 0.170493 0.168250 0.190299 -0.231285 0.220253 0.234991 -0.014101 0.196930 -0.029541 0.163608 0.176785 0.170319 0.172822 -0.164141 -0.162027 -0.170033 -0.163714 -0.148124 -0.173964 -0.155558 -0.146276 -0.166006 -0.164055 -0.158418 -0.159967 -0.162045 -0.151334 -0.266340 0.100686 0.091628 0.114266 -0.255910 0.104275 0.085054 0.099633 -0.259458 0.108950 0.094486 0.085234 -0.260636 0.085660 0.094103 0.108365 -0.047476 0.019420 0.012832 -0.026509 -0.047372 0.019668 0.018593 -0.052591 -0.045411 0.021716 0.013134 -0.022289 -0.049859 0.026494 0.021988 -0.058579 -0.243378 0.237841 0.072133 -0.145977 0.082427 0.230231 0.029894 0.162428 0.159313 0.006788 -0.019996 0.043913
chargesum: -0.00009
1716.lowfreq: -524.8998 -1.5790 -0.0050 -0.0047 -0.0035 2.2156 2.6386 11.6511 15.4764
temp: 298.150 k
press: 1.00000 atm
elementType: 15 7 15 7 16 8 8 8 6 6 6 6 6 6 6 6 6 6 6 6 1 1 1 6 6 6 6 6 6 1 6 6 6 6 6 6 1 1 8 7 16 8 8 8 6 6 6 6 6 6 6 6 6 6 6 6 1 1 1 6 6 6 6 6 6 1 6 6 6 6 6 6 1 1 8 1 1 1 1 1 1 1 1 6 6 6 6 6 6 6 6 6 6 6 6 6 6 6 6 6 6 6 6 9 9 9 9 9 9 9 9 9 9 9 9 9 9 6 6 1 1 1 6 1 1 1 6 1 1 1 6 6 1 1 1 6 1 1 1 6 1 1 1 6 6 1 1 1 6 1 1 1 6 1 1 1 6 6 1 1 1 6 1 1 1 6 1 1 1 6 6 6 6 1 1 1 1 6 6 6 6 1 1 1 1 6 6 6 6 1 1 1 1 6 6 6 6 1 1 1 1 6 6 1 1 1 6 1 1 6 6 6 6 1 1 6 1 1 1 1 1 1 6 1 1 6 1 1 6 1 1 6 1 1 1 1
symmnumber: 1
zpe: 4799547.4 jmol-1
zpe.correction: 1.828051 hartree
zpe.thermalcorrener: 1.953381 hartree
zpe.thermalcorrenthalpy: 1.954325 hartree
zpe.thermalcorrgfe: 1.666733 hartree
zpe.sumelectzpe: -7961.773434 hartree
zpe.sumelectthermal: -7961.648105 hartree
zpe.sumelectthermalent: -7961.647161 hartree
zpe.sumelectthermalfe: -7961.934752 hartree
dipole: -4.8242 1.0260 1.9955
dipole: 5.3205
quadrupole: -785.4347 -771.2308 -853.7241
quadrupole: -16.6898 19.8282 17.4985
quadrupole: 18.0285 32.2324 -50.2609 -16.6898 19.8282 17.4985
hfenergy: -7963.6014854 hartree
pointgroup: C01 [X(C112H95F14N3O8P2S2)]
dipole: -1.8979824 0.4036614 0.7850813 debye
polarizability: 2110.501563|-12.5988652|1766.7002879|125.5601368|30.1425385|1552.7125985 unknown
InChI: InChI=1S/C100H72F14N3O8P2S2.C12H23/c1-97(2,3)57-37-29-49(30-38-57)65-45-53-21-13-17-25-61(53)69-70-62-26-18-14-22-54(62)46-66(50-31-39-58(40-32-50)98(4,5)6)92(70)123-126(122-91(65)69,116-128(118,119)95-83(107)75-73(81(105)89(95)113)77(101)85(109)87(111)79(75)103)115-127(117-129(120,121)96-84(108)76-74(82(106)90(96)114)78(102)86(110)88(112)80(76)104)124-93-67(51-33-41-59(42-34-51)99(7,8)9)47-55-23-15-19-27-63(55)71(93)72-64-28-20-16-24-56(64)48-68(94(72)125-127)52-35-43-60(44-36-52)100(10,11)12;1-4-5-9-12(3)10-7-6-8-11(12)2/h13-48H,1-12H3;4-10H2,1-3H3
charge 0 multiplicity 1
236 atoms
P  -1.314871 -0.727573 0.266563
N  0.165139 -1.125446 -0.044504
P  1.516189 -0.322552 -0.17385
N  1.501898 1.253208 -0.383184
S  1.933968 2.034936 -1.714933
O  1.691491 3.470304 -1.521134
O  1.406753 1.42941 -2.946556
O  2.345305 -0.738595 1.167431
C  3.713405 -0.546137 1.241226
C  4.535725 -1.35713 0.468042
C  5.945488 -1.097753 0.471629
C  6.463011 -0.113961 1.376795
C  5.573665 0.611678 2.208631
C  4.19998 0.437598 2.154294
C  3.299017 1.163803 3.084526
C  2.157419 0.54933 3.633977
C  1.387819 1.194516 4.594699
C  1.706928 2.478696 5.063949
C  2.831725 3.099932 4.498504
C  3.605995 2.461897 3.524952
H  4.454005 2.99156 3.086673
H  1.868605 -0.451602 3.326719
H  5.996673 1.317706 2.924424
C  3.940828 -2.502316 -0.282028
C  2.889781 -2.28535 -1.15845
C  2.178611 -3.319332 -1.832934
C  2.596105 -4.617462 -1.59464
C  3.649398 -4.919553 -0.693737
C  4.335545 -3.858685 -0.013511
H  2.091825 -5.442918 -2.1006
C  1.015464 -3.03176 -2.707648
C  -0.113931 -3.869348 -2.666164
C  -1.199283 -3.655482 -3.511058
C  -1.213005 -2.597688 -4.438331
C  -0.098361 -1.745654 -4.449217
C  0.99348 -1.950374 -3.602265
H  1.831302 -1.256794 -3.645602
H  -0.155718 -4.685626 -1.943341
O  2.456736 -0.978629 -1.332972
N  -1.638087 0.723941 0.868951
S  -2.120504 1.017014 2.343374
O  -1.439347 0.29324 3.415319
O  -2.12584 2.519004 2.500735
O  -2.123036 -0.96639 -1.121724
C  -3.501785 -1.083051 -1.16153
C  -4.080241 -2.222064 -0.614745
C  -5.51069 -2.321583 -0.602391
C  -6.273648 -1.33323 -1.305482
C  -5.611759 -0.236853 -1.913304
C  -4.237668 -0.062715 -1.838886
C  -3.573039 1.080363 -2.515733
C  -2.28789 0.97424 -3.085399
C  -1.713877 2.041287 -3.766491
C  -2.386388 3.262534 -3.934879
C  -3.668446 3.365728 -3.374052
C  -4.244452 2.305153 -2.670435
H  -5.222918 2.447443 -2.210031
H  -1.724065 0.049361 -3.011304
H  -6.212488 0.479396 -2.475495
C  -3.206353 -3.34039 -0.152467
C  -2.19556 -3.105192 0.765511
C  -1.246842 -4.080672 1.185136
C  -1.368334 -5.343208 0.630864
C  -2.355654 -5.6514 -0.339308
C  -3.290499 -4.644888 -0.753384
H  -0.67287 -6.128364 0.93321
C  -0.152041 -3.762744 2.133857
C  -0.352681 -2.980282 3.281278
C  0.686169 -2.765835 4.190533
C  1.965187 -3.308131 3.992864
C  2.167889 -4.054496 2.817908
C  1.13712 -4.27851 1.910085
H  1.343043 -4.84288 0.999403
H  -1.327222 -2.536768 3.477868
O  -2.048653 -1.80675 1.244585
H  -0.705189 1.907123 -4.156679
H  -4.233055 4.294294 -3.456024
H  -0.060714 -0.897364 -5.131842
H  -2.052713 -4.330713 -3.437508
H  3.116998 4.105986 4.805229
H  0.512448 0.672028 4.978003
H  0.475073 -2.162803 5.073129
H  3.150763 -4.472197 2.59753
C  -3.860988 0.537106 2.350118
C  -4.74514 1.219122 1.534287
C  -4.320566 -0.613764 3.037342
C  -6.102379 0.838622 1.393843
C  -5.626197 -1.035514 2.904152
C  -6.557548 -0.324835 2.107254
C  -7.021184 1.539067 0.567422
C  -7.913401 -0.716866 1.973931
C  -8.329441 1.127263 0.460297
C  -8.777897 -0.003382 1.175167
C  3.742111 1.842882 -1.721199
C  4.430602 1.085755 -2.647778
C  4.479353 2.477612 -0.690128
C  5.849784 0.957497 -2.614682
C  5.849695 2.404859 -0.634999
C  6.582107 1.669893 -1.601581
C  6.574261 0.160847 -3.541964
C  7.996127 1.592691 -1.597597
C  7.949439 0.083956 -3.486882
C  8.663554 0.80945 -2.512584
F  8.62164 -0.684152 -4.337964
F  9.985347 0.693964 -2.462635
F  8.715724 2.252648 -0.69228
F  5.951211 -0.54363 -4.48341
F  3.782503 0.439642 -3.609629
F  6.47799 3.018301 0.370358
F  3.849996 3.146028 0.273311
F  -3.516652 -1.332338 3.808458
F  -5.997297 -2.142622 3.545495
F  -8.378066 -1.801602 2.587611
F  -10.031705 -0.404036 1.015537
F  -9.177497 1.755636 -0.345239
F  -6.637884 2.59781 -0.145664
F  -4.305973 2.256203 0.82675
C  -1.700284 4.397716 -4.704667
C  -1.4757 3.942661 -6.162937
H  -2.433742 3.706431 -6.652505
H  -0.981094 4.739991 -6.74104
H  -0.839908 3.04608 -6.210531
C  -0.335623 4.703963 -4.052807
H  0.181364 5.502362 -4.609143
H  -0.457138 5.039535 -3.012817
H  0.322099 3.825208 -4.024081
C  -2.544622 5.679999 -4.718024
H  -2.739954 6.05092 -3.700654
H  -2.011341 6.473576 -5.262965
H  -3.513878 5.525865 -5.216686
C  0.854065 3.105183 6.175749
C  1.249982 4.561341 6.462778
H  1.139618 5.196717 5.571758
H  0.603075 4.973879 7.25234
H  2.290607 4.640346 6.812884
C  -0.6388 3.064145 5.785808
H  -1.252475 3.497013 6.591889
H  -0.826509 3.636413 4.866411
H  -0.99302 2.040971 5.599689
C  1.060364 2.278342 7.464539
H  2.118962 2.284208 7.768631
H  0.462513 2.697405 8.290284
H  0.754862 1.230847 7.3214
C  -2.393136 -2.441091 -5.408787
C  -2.258596 -1.189226 -6.28977
H  -3.130097 -1.112753 -6.958282
H  -2.217666 -0.270218 -5.686346
H  -1.35796 -1.227771 -6.921485
C  -2.440078 -3.684577 -6.323266
H  -3.272593 -3.601735 -7.040888
H  -1.503588 -3.78823 -6.893696
H  -2.58615 -4.60687 -5.740674
C  -3.715516 -2.340568 -4.623918
H  -3.880279 -3.219514 -3.986036
H  -3.724998 -1.451706 -3.980533
H  -4.566706 -2.265217 -5.319542
C  3.107828 -3.150443 5.00727
C  4.3397 -2.523534 4.324428
H  5.172732 -2.444713 5.041298
H  4.684961 -3.126569 3.473791
H  4.116414 -1.5152 3.952796
C  3.483087 -4.550375 5.540509
H  3.825758 -5.211563 4.730217
H  4.29615 -4.47291 6.280573
H  2.619365 -5.029789 6.027695
C  2.710517 -2.264325 6.198114
H  3.560365 -2.176845 6.89256
H  2.436293 -1.24889 5.876408
H  1.864657 -2.68929 6.760109
C  4.005422 -6.26975 -0.4168
C  4.978757 -6.571437 0.510667
C  5.63964 -5.526737 1.201774
C  5.328356 -4.207448 0.944182
H  5.840483 -3.420644 1.493638
H  3.477112 -7.066073 -0.946671
H  6.398075 -5.766036 1.950448
H  5.235858 -7.611852 0.721303
C  6.850652 -1.767008 -0.397069
C  8.205277 -1.515754 -0.334697
C  8.722789 -0.581651 0.596766
C  7.867382 0.110363 1.425327
H  8.252316 0.860698 2.119088
H  6.459869 -2.480143 -1.122999
H  9.796604 -0.386928 0.628424
H  8.884541 -2.027683 -1.019987
C  -2.401901 -6.93851 -0.945585
C  -3.311411 -7.221582 -1.940981
C  -4.216517 -6.221054 -2.371409
C  -4.208143 -4.969205 -1.791384
H  -4.904187 -4.212772 -2.146424
H  -1.686744 -7.695347 -0.614483
H  -4.923815 -6.438413 -3.174797
H  -3.330318 -8.209735 -2.405786
C  -6.202377 -3.365418 0.070771
C  -7.575922 -3.467501 -0.005277
C  -8.325009 -2.534869 -0.764466
C  -7.686821 -1.484675 -1.38805
H  -8.260507 -0.737717 -1.942187
H  -5.631637 -4.087971 0.654473
H  -9.410928 -2.629672 -0.823147
H  -8.090911 -4.270079 0.526308
C  -1.40055 5.887645 1.283782
C  -2.376697 4.196308 -0.449278
H  -2.332405 3.134316 -0.714697
H  -3.385796 4.438147 -0.090367
H  -2.212915 4.775154 -1.369177
C  -1.88254 7.009859 0.329131
H  -2.013833 7.917818 0.941771
H  -2.889372 6.756543 -0.039785
C  -1.318961 4.556606 0.540913
C  -0.019209 6.253437 1.875731
C  -0.321383 3.644993 0.811418
C  0.648699 5.10149 2.621206
H  -0.143494 7.129207 2.532677
H  0.647714 6.564766 1.057046
C  0.865464 3.910651 1.692075
H  -0.265103 2.749258 0.188558
H  -1.348099 3.251678 1.589045
H  1.610375 5.427747 3.0431
H  0.029985 4.79412 3.476817
H  1.716238 4.075081 1.012763
H  1.108372 2.997679 2.253336
C  -2.450808 5.746478 2.412307
H  -2.561872 6.714287 2.924114
H  -2.160223 4.992299 3.15467
C  -0.976428 7.339009 -0.859326
H  -0.037435 7.794691 -0.505397
H  -0.67609 6.4151 -1.382802
C  -1.638514 8.28707 -1.860555
H  -1.964246 9.201129 -1.332312
H  -2.562011 7.818882 -2.245286
C  -0.726397 8.660718 -3.027117
H  0.181568 9.176035 -2.67245
H  -0.402827 7.763868 -3.578487
H  -1.23428 9.327926 -3.741247
H  -3.433639 5.456994 2.012254
