program: Gaussian 09
title: Fe_DFO_s2
version: ES64L-G09RevD.01
frameworkgroup: C1[X(C25H46FeN6O8)]
method: UB3LYP
basis: Gen
operation: Freq
keyword: #P
keyword: Geom=AllCheck
keyword: Guess=TCheck
keyword: SCRF=Check
keyword: Test
keyword: GenChk
keyword: UB3LYP/ChkBas
keyword: Freq
converged: YES YES NO NO
polarizability: 5.27104786e+02 7.49064160e+00 5.62863161e+02 8.10063324e+00 1.05246921e+01 4.84889601e+02
1716.lowfreq: -14.5323 -0.0042 -0.0028 -0.0016 4.0751 17.3200 19.6319 28.2147 36.2542
frequency: 13.8126 26.8790 35.6305 36.8375 39.3796 48.9751 54.4953 62.4985 64.8522 70.8211 76.2894 87.3016 88.4693 95.0678 99.9323 117.6690 125.2541 128.8915 129.7859 136.0628 143.6317 151.1664 164.1574 168.0295 174.4165 179.5131 186.7215 202.2174 205.5046 215.0753 215.8504 232.1652 234.1950 245.8958 249.6182 261.4479 263.5399 273.0474 278.1118 287.3041 295.6348 304.1896 315.8024 325.4879 331.4663 338.8025 346.1270 351.2378 358.4089 360.7433 376.6505 384.1452 401.9775 408.7921 430.3263 433.2170 450.6577 483.8169 487.0472 494.2367 499.6052 506.5592 515.2562 518.7098 532.9888 539.2834 549.0717 553.7676 558.9818 562.4680 592.5645 598.5895 619.0406 625.7269 629.9550 650.0502 652.8882 660.0428 698.7530 721.8113 739.6424 753.0971 754.2858 760.2414 770.8723 781.6830 806.6559 836.5231 838.4803 846.6057 851.3857 856.7546 866.7070 880.6376 909.8829 914.8413 915.6762 925.8725 947.8331 950.3060 964.4612 968.8188 982.3665 985.2238 990.9832 995.3628 1004.0634 1010.3997 1014.6457 1024.1950 1028.8822 1031.5171 1047.4250 1048.7764 1055.0015 1070.9936 1074.9457 1076.9598 1086.0712 1091.4323 1107.5825 1114.7869 1117.9271 1121.0716 1136.0807 1140.2322 1144.8792 1160.8386 1192.5143 1199.3161 1209.6764 1211.3305 1221.6586 1224.2976 1227.1604 1239.6800 1246.6701 1250.6718 1256.7741 1257.3892 1268.7507 1286.9651 1291.6921 1298.4578 1304.0715 1311.5819 1311.7053 1313.9966 1326.4196 1333.2314 1339.1272 1351.0155 1358.2898 1360.3534 1365.0138 1370.4236 1377.3021 1386.5617 1391.1078 1392.0374 1396.2432 1398.3120 1398.7833 1402.1314 1406.6146 1407.9008 1411.4694 1411.5590 1414.5555 1423.4580 1423.5241 1442.4505 1447.6981 1452.3059 1457.9047 1461.2978 1467.5808 1471.8202 1472.3575 1476.0326 1476.5822 1480.2851 1482.8180 1484.0595 1484.6282 1487.6532 1488.5199 1490.7681 1490.9735 1494.5837 1495.8929 1496.7481 1498.4909 1498.9564 1502.0849 1505.3060 1528.2215 1567.3646 1573.4662 1584.2629 1593.0652 1599.9729 1604.4589 1606.0769 1678.9536 1681.1466 3031.6779 3035.3810 3038.6794 3042.1768 3047.3258 3048.8511 3051.0954 3058.9419 3062.1539 3067.0860 3070.2225 3072.4808 3073.6254 3075.2924 3075.9931 3080.8917 3083.8086 3084.2120 3086.5873 3092.0620 3093.7564 3094.1240 3095.9578 3097.4745 3102.9033 3108.4831 3109.8214 3111.7111 3113.7880 3119.0698 3137.2663 3137.7890 3141.1214 3149.0257 3151.2369 3152.9531 3155.1567 3169.2716 3171.3225 3174.5210 3175.3336 3418.4415 3504.3292 3513.4657 3608.5151 3627.3189
redmass: 5.2383 5.6417 5.4448 4.5741 4.5045 5.1268 6.0202 6.6018 4.4718 5.0067 5.7870 4.3643 4.0514 3.6062 4.6209 4.8445 3.1894 2.4732 1.3416 3.0412 3.9986 2.6980 3.4612 6.3295 4.4821 4.6444 5.1893 6.0179 3.9872 4.5804 3.8251 3.4183 3.7229 4.0677 2.9358 2.9053 2.7304 2.6530 4.1684 2.5228 4.0486 2.0323 1.2995 3.0779 3.0873 3.0117 6.6011 3.0694 4.1594 3.2444 2.8754 2.6931 3.7497 3.2464 2.8921 2.6868 2.7743 2.3516 2.7572 3.9732 3.4320 2.0698 2.6773 2.1750 4.4087 2.8901 5.3777 2.8578 2.4498 4.0804 2.0000 3.3739 3.7397 3.7879 3.6522 2.8106 3.4730 5.1061 3.2247 2.3639 2.4686 1.6208 1.9940 1.9520 1.7926 1.8516 1.5324 2.3229 2.1969 1.8744 1.8895 2.4752 1.6822 2.2533 1.9048 2.3385 2.2832 1.8068 2.5519 2.5807 2.5092 2.5701 2.4751 2.4168 1.8517 1.6794 2.0459 2.5538 2.9878 1.8995 1.9217 2.2820 2.4216 2.4500 1.5803 2.0828 1.9519 1.9944 1.8964 2.0441 2.6083 2.9556 2.4280 2.4833 2.2223 1.7917 2.3557 2.0181 1.2682 1.6596 1.4113 1.4503 2.3846 2.0249 3.6848 1.2966 1.5143 1.5887 1.5420 1.4645 1.3606 1.4431 1.4428 1.2950 1.4301 1.2521 1.2509 1.2054 1.2604 1.1528 1.1792 1.1314 1.2146 1.2101 1.1332 1.4237 1.4566 1.3935 1.3965 1.4502 1.3556 1.2824 1.3872 1.3382 1.2451 1.3087 1.4062 1.4609 1.3534 1.4398 1.4541 1.4481 1.1170 1.2922 1.1459 1.1001 1.0622 1.2220 1.4803 1.1261 1.2090 1.1708 1.2287 1.1595 1.3081 2.5286 1.1245 1.0937 1.1847 1.2036 1.1594 1.1097 1.0831 1.2422 1.0926 2.7303 1.0977 2.0861 2.1323 6.0401 5.3642 6.1293 1.0382 1.0402 7.7961 7.2011 1.0605 1.0604 1.0617 1.0642 1.0629 1.0648 1.0664 1.0642 1.0646 1.0382 1.0984 1.0968 1.0700 1.0627 1.0852 1.0839 1.0652 1.0641 1.0948 1.0900 1.0690 1.0643 1.0737 1.0646 1.0992 1.0994 1.0702 1.0920 1.0995 1.1019 1.1018 1.1046 1.1010 1.1058 1.0982 1.1020 1.1009 1.0936 1.1108 1.1037 1.0973 1.0308 1.0937 1.0940 1.0781 1.0788
irintensity: 4.2701 3.0507 4.2787 14.7377 6.9811 11.1370 5.5738 3.3326 12.4653 5.3493 20.2327 10.1159 4.7509 6.8190 0.8248 7.2767 1.3813 3.1086 4.8622 13.7234 4.8781 3.7568 8.3306 4.5232 4.7483 3.6037 9.7161 5.7219 9.0699 0.6031 2.9650 11.7336 24.9942 19.6130 2.2833 7.0704 4.1388 2.9719 21.8297 7.6701 33.4727 17.1322 4.2063 6.4702 23.5413 68.2739 77.4591 11.4436 138.7523 9.9461 53.1039 7.5454 22.4905 23.7576 3.1938 17.4746 6.3091 76.8728 91.5482 35.5473 3.1992 143.3455 25.8395 72.9780 164.8747 189.1028 33.8574 33.0267 23.8389 1.4996 9.6376 16.8191 11.9976 29.0716 45.7132 11.4172 31.9257 8.1725 29.2207 14.1704 39.5476 4.9836 32.2030 38.4867 20.1117 59.5607 17.0737 5.1358 9.4959 6.4148 29.8348 11.7212 15.2300 2.3910 31.9369 3.6318 17.4614 15.3319 8.8426 35.0511 30.9848 18.6171 50.4618 69.0325 32.9807 27.4439 9.6870 35.6547 63.8960 20.7102 14.2867 48.6060 45.9917 24.3514 13.9312 2.8782 13.6607 15.3466 21.7023 14.6065 2.8868 14.3104 7.7364 9.4997 16.1995 1.9885 21.1941 52.7387 59.6347 19.3568 8.2972 9.8022 20.0321 10.7533 4.0513 8.9155 8.1720 17.0531 82.5238 30.9096 38.2803 38.3412 54.6907 44.9485 24.9245 30.2077 4.4787 4.5460 4.6405 8.5033 8.0197 5.0082 2.4127 4.1478 14.5412 12.6323 5.6201 9.4367 22.5400 29.0867 22.2011 26.6490 23.1711 6.6476 15.8467 40.7367 22.3647 3.8528 1.6446 3.2286 7.2006 24.1443 55.2941 179.5302 61.4051 15.4118 6.7532 44.7448 79.7339 5.7630 28.1504 174.8230 3.9943 33.5195 67.5860 162.2499 47.3131 33.2279 51.7910 55.3490 15.5340 17.3618 1.9059 28.3223 11.1723 116.6163 12.4528 377.7340 432.0258 315.7053 340.6969 424.1168 71.0576 60.8275 562.2933 517.0532 43.9283 15.0344 37.3067 68.6567 24.7857 58.9732 52.7561 25.6008 39.3699 2.0286 38.3222 8.2705 13.9674 22.4405 33.0186 120.1440 17.3449 40.7520 26.6311 32.2927 62.2977 43.1020 38.1334 32.5848 143.6360 31.6399 36.7663 40.7601 42.0010 11.6087 5.8602 40.9194 12.0364 24.1967 11.7222 24.9472 16.3251 27.8940 19.4936 6.7211 22.1365 64.1939 174.8614 173.5736 93.2497 97.4790
temp: 298.150 k
press: 1.00000 atm
elementType: 26 8 7 6 8 8 7 6 8 8 7 6 8 6 6 6 6 6 7 6 6 6 7 6 6 6 6 6 8 6 6 6 7 6 6 6 6 6 8 6 1 1 1 1 1 1 1 1 1 1 1 1 1 1 1 1 1 1 1 1 1 1 1 1 1 1 1 1 1 1 1 1 1 1 1 1 1 1 1 1 1 1 1 1 1 1
symmnumber: 1
zpe: 1953182.3 jmol-1
zpe.correction: 0.743928 hartree
zpe.thermalcorrener: 0.785990 hartree
zpe.thermalcorrenthalpy: 0.786934 hartree
zpe.thermalcorrgfe: 0.667900 hartree
zpe.sumelectzpe: -2034.038231 hartree
zpe.sumelectthermal: -2033.996169 hartree
zpe.sumelectthermalent: -2033.995225 hartree
zpe.sumelectthermalfe: -2034.114260 hartree
dipole: 27.9663 -12.6221 20.9477
dipole: 37.1516
quadrupole: -72.6183 -145.9788 -206.3086
quadrupole: -23.8001 74.4648 -23.7430
quadrupole: 69.0170 -4.3436 -64.6734 -23.8001 74.4648 -23.7430
hfenergy: -2034.7821593 hartree
pointgroup: C01 [X(C25H46Fe1N6O8)]
dipole: 11.2733727 -4.6126782 8.0794733 debye
polarizability: 526.8312687|6.3711783|563.2645506|7.2051|10.9597628|484.7617285 unknown
InChI: InChI=1S/C25H46N6O8.Fe/c1-21(32)29(37)18-9-3-6-16-27-22(33)12-14-25(36)31(39)20-10-4-7-17-28-23(34)11-13-24(35)30(38)19-8-2-5-15-26;/h27-28H,2-20H2,1,26H3;/q-6;+6
charge 1 multiplicity 6
86 atoms
Fe -0.00857707 -0.67784881 -0.48072865
O  1.5093721 -1.17011187 -1.68078617
N  2.72879552 -0.67108322 -1.28444724
C  2.75505595 -0.00731962 -0.13136891
O  1.67352621 0.10050574 0.53967426
O  -0.54596939 1.03228106 -1.40288482
N  -1.3863915 1.83053982 -0.66505597
C  -1.68349054 1.42290544 0.56182275
O  -1.24069965 0.28743228 0.95494012
O  -1.25373981 -1.89888655 -1.46232321
N  -1.58374506 -3.03383918 -0.75900081
C  -0.97532321 -3.22755378 0.40565853
O  -0.08653413 -2.38770479 0.78437304
C  3.84855772 -1.2472618 -2.02773876
C  3.87829671 -2.78104587 -1.88659116
C  3.72920202 -3.27872206 -0.44223434
C  4.88641023 -2.87047798 0.48418879
C  4.44940304 -2.89733069 1.94154185
N  5.53363323 -2.35486945 2.83507654
C  4.00045744 0.67352428 0.38406167
C  3.66971375 2.04457801 0.98231885
C  3.07078937 3.00409611 -0.0393714
N  2.98906305 4.29077924 0.3601521
C  2.29849207 5.33580738 -0.39145679
C  0.91253023 5.66661591 0.17679646
C  -0.10282338 4.51617093 0.13805647
C  -0.49173678 4.07740336 -1.27936271
C  -1.67871656 3.11101763 -1.31281553
O  2.69416393 2.61748178 -1.16070994
C  -2.49124498 2.26937187 1.51704215
C  -3.44981112 1.42912128 2.37348219
C  -4.63564614 0.93369349 1.56030573
N  -4.85615729 -0.39705775 1.56677644
C  -5.91259111 -1.0164484 0.76602182
C  -5.62388501 -1.01408437 -0.74255001
C  -4.2605324 -1.60120406 -1.12439678
C  -4.07805361 -3.06679283 -0.70956633
C  -2.79105183 -3.71256864 -1.23469765
O  -5.37474144 1.73343481 0.95786636
C  -1.32376191 -4.4144912 1.25700524
H  4.77062769 -0.79719661 -1.66295747
H  3.73417537 -0.96692805 -3.07855494
H  4.82177957 -3.13034355 -2.32229336
H  3.06969262 -3.20401918 -2.48977128
H  3.6355928 -4.37014897 -0.44752084
H  2.78302061 -2.89659718 -0.03867777
H  5.74573405 -3.53513973 0.33772079
H  5.22862897 -1.85854293 0.24614994
H  4.22743037 -3.90702164 2.29105902
H  3.57403617 -2.26481941 2.10284858
H  5.26273019 -2.40308261 3.82187029
H  6.40608194 -2.88065157 2.71858718
H  5.72637132 -1.37358328 2.60763229
H  4.57533797 2.48242673 1.41293958
H  2.95132686 1.93531445 1.80156417
H  3.24526315 4.50128094 1.3171614
H  2.23259482 5.0021314 -1.42791675
H  2.92172675 6.23548001 -0.37736529
H  1.0354868 6.00506832 1.21348149
H  0.51849106 6.52266565 -0.38622927
H  0.29287846 3.65750029 0.69587027
H  -1.00653259 4.83730193 0.67092466
H  0.35998403 3.61098729 -1.78321255
H  -0.77883347 4.95367892 -1.8740783
H  -1.94911062 2.86801336 -2.34375865
H  -2.55434478 3.55148334 -0.83526027
H  -1.77161137 2.77588392 2.16991962
H  -3.05368881 3.04364495 0.99647153
H  -3.85769082 2.07239128 3.15983467
H  -2.9164706 0.60753699 2.8556216
H  -4.12239273 -0.99435136 1.92481867
H  -6.84574753 -0.48079356 0.96173542
H  -6.03672174 -2.03588457 1.13758574
H  -5.68035766 0.01810329 -1.10398619
H  -6.42919158 -1.572511 -1.23683077
H  -3.47000432 -0.99413804 -0.67100845
H  -4.12960132 -1.51485842 -2.21013681
H  -4.91869431 -3.66572577 -1.08342699
H  -4.08811167 -3.15647136 0.38370656
H  -2.73533971 -4.76067155 -0.93507628
H  -2.74830538 -3.67512784 -2.32620761
H  -0.63082202 -4.45146992 2.09797938
H  -2.34538731 -4.3248833 1.63997213
H  -1.25461318 -5.34690886 0.69023225
H  4.43394985 0.04455302 1.16981053
H  4.74496541 0.77901466 -0.40501508
