program: Gaussian 09
title: Aldfo
version: ES64L-G09RevD.01
frameworkgroup: C1[X(C25H46AlN6O8)]
method: RB3LYP
basis: Gen
operation: Freq
keyword: #P
keyword: Geom=AllCheck
keyword: Guess=TCheck
keyword: SCRF=Check
keyword: Test
keyword: GenChk
keyword: RB3LYP/ChkBas
keyword: Freq
converged: YES YES YES YES
title: Mulliken charges:
elementType: O N C O O N C O O N C O C C C C C N C C C N C C C C C O C C C N C C C C C O C H H H H H H H H H H H H H H H H H H H H H H H H H H H H H H H H H H H H H H H H H H H H H H Al
charge: -0.713222 -0.048159 0.546391 -0.695608 -0.709955 -0.052555 0.543441 -0.693048 -0.709940 -0.040597 0.513087 -0.682588 -0.066673 -0.188366 -0.190376 -0.189103 -0.102609 -0.507452 -0.248166 -0.281568 0.543787 -0.482969 -0.064314 -0.187463 -0.187669 -0.182149 -0.075375 -0.579777 -0.260535 -0.259433 0.533616 -0.480869 -0.066392 -0.188929 -0.187844 -0.183072 -0.072477 -0.600847 -0.391077 0.148120 0.143314 0.117790 0.116518 0.114395 0.115502 0.127245 0.132107 0.175889 0.178248 0.385981 0.382992 0.382650 0.153686 0.160176 0.307167 0.131891 0.123639 0.104421 0.108159 0.110063 0.104930 0.114757 0.112078 0.141167 0.148302 0.168564 0.149966 0.150581 0.133967 0.312640 0.124938 0.130379 0.102552 0.103989 0.116845 0.098794 0.113626 0.118055 0.147649 0.142056 0.154836 0.170456 0.158017 0.162630 0.150450 1.638680
chargesum: 1.00000
title: Mulliken charges with hydrogens summed into heavy atoms:
elementType: O N C O O N C O O N C O C C C C C N C C C N C C C C C O C C C N C C C C C O C Al
charge: -0.713222 -0.048159 0.546391 -0.695608 -0.709955 -0.052555 0.543441 -0.693048 -0.709940 -0.040597 0.513087 -0.682588 0.224761 0.045942 0.039521 0.070248 0.251528 0.644171 0.064914 0.032294 0.543787 -0.175802 0.191217 0.025117 0.027323 0.044686 0.214093 -0.579777 0.057995 0.025115 0.533616 -0.168229 0.188925 0.017612 0.027795 0.048609 0.217227 -0.600847 0.092233 1.638680
polarizability: 4.53770799e+02 2.68290625e+00 4.86500350e+02 1.05143922e+01 5.27229594e+00 4.59170927e+02
1716.lowfreq: 0.0012 0.0014 0.0016 0.1071 8.2002 13.5049 17.2889 27.4286 29.9618
frequency: 15.5368 27.1910 29.9486 36.2045 42.1857 44.7237 57.3275 61.2656 64.4356 69.8646 79.0791 85.5503 94.2549 98.6742 105.6987 112.3515 119.2461 133.0054 139.8565 147.8977 156.9846 163.5679 165.9903 177.5149 185.6520 198.5613 210.8868 214.3560 216.7995 226.5092 234.3754 241.4456 250.0387 252.0706 264.1115 269.3992 281.2480 286.1366 294.2362 300.6327 304.6995 323.3305 326.2288 341.6589 348.6994 355.2909 368.7430 380.4261 397.5474 411.1412 416.7081 421.2340 429.9245 436.2488 461.3695 469.9799 482.1033 497.4133 503.7398 514.7776 520.7182 525.2625 532.7347 538.2202 546.4014 560.9799 567.9533 599.6603 601.6501 611.2203 614.8906 620.0124 623.9893 630.6695 654.6657 655.1739 662.1694 670.3997 696.0107 722.7010 742.1039 756.9012 761.6687 763.6032 772.5265 780.8521 820.2371 837.9857 842.5855 850.4818 857.7175 859.2874 866.0201 882.0224 911.1151 913.0530 916.1735 927.9995 950.1990 951.4484 965.2126 967.1156 979.7800 990.0614 1000.4716 1000.7588 1005.5278 1012.5456 1017.4023 1026.9947 1032.6091 1035.2769 1050.5657 1052.3190 1055.1215 1075.5337 1078.6544 1079.4569 1089.3475 1095.5586 1107.8880 1113.5690 1118.5393 1120.5343 1136.5825 1144.3465 1147.4449 1164.2123 1194.2698 1201.2754 1206.5331 1214.4321 1229.1948 1233.9469 1239.0589 1243.3739 1249.9609 1257.8165 1260.4199 1262.7572 1272.3272 1280.8592 1297.0707 1298.3706 1307.7568 1312.8693 1315.7521 1316.6516 1329.4775 1332.9783 1337.9046 1352.3747 1358.6305 1363.6602 1369.3198 1377.2383 1381.7845 1388.4016 1391.5273 1392.9974 1396.9122 1399.8174 1403.4351 1403.7528 1409.6110 1410.0515 1411.2102 1412.4093 1415.7477 1421.4322 1427.7735 1446.3843 1450.7113 1451.3465 1451.9461 1457.8189 1467.3128 1474.3670 1474.9531 1478.8104 1481.1136 1481.9633 1483.6004 1483.6979 1488.2434 1489.7940 1491.1735 1493.2021 1495.7368 1495.8930 1498.1466 1498.5982 1498.7402 1501.9843 1504.0072 1513.3274 1518.1049 1567.8999 1570.7528 1604.1068 1606.7050 1634.4592 1639.1675 1645.5223 1683.0761 1683.4468 3030.1685 3036.8910 3037.6586 3042.9603 3043.3545 3051.2758 3051.5047 3052.1262 3056.8323 3067.5396 3068.5234 3070.2658 3070.7387 3074.8557 3076.1897 3079.3788 3079.9414 3080.8090 3083.2149 3086.3467 3094.0439 3095.5820 3097.0828 3098.7870 3103.0161 3105.1815 3108.8840 3110.9054 3116.7192 3120.4671 3137.8584 3139.1880 3141.6470 3151.3079 3152.0697 3156.5204 3161.6605 3163.7003 3171.6950 3180.3172 3180.7603 3422.2320 3508.7096 3516.1195 3604.8466 3623.6783
redmass: 4.8013 5.4413 4.7450 4.3628 3.9753 5.4434 5.4504 5.4511 4.7134 4.6395 5.7560 4.3486 4.3257 4.8993 3.5516 1.1382 3.7078 3.0102 3.5520 2.7067 3.2976 2.8241 3.4795 3.1990 3.7605 4.7892 4.0338 3.7522 4.3507 4.0229 5.1396 4.1805 3.6262 2.8710 2.8933 3.2085 2.5351 1.4578 2.1074 4.5948 3.6841 3.0052 3.5745 3.0976 2.9878 2.6573 3.5849 2.7323 3.1450 2.5842 3.0812 3.1316 3.1566 2.6055 3.8285 4.0095 5.1610 2.5739 2.9029 3.8403 3.3784 2.0668 2.7968 2.2989 3.5569 2.2069 1.8548 3.2153 2.0196 8.5929 6.4097 7.2139 4.2135 4.2480 2.7828 4.1233 4.5777 4.0823 3.4409 2.2738 2.1422 1.8565 2.2723 1.3787 2.2580 2.1169 1.4206 2.3958 2.2519 1.8463 2.4316 2.0927 1.6761 2.3120 1.9412 2.2645 2.2483 1.7394 2.6749 2.5853 2.3311 2.5020 2.3088 2.2145 2.1567 1.9091 1.9201 2.4759 2.8818 1.9222 1.8823 2.2512 2.2777 2.4887 1.5649 2.1867 1.9236 2.1263 1.8767 2.1032 2.5086 2.9665 2.4147 2.4603 2.1358 1.6583 2.3731 2.0519 1.3827 1.3334 1.2470 1.3807 2.0503 1.8789 3.3264 1.2722 1.4728 1.8007 1.5608 2.0188 1.4928 1.5881 1.4721 1.2878 1.4260 1.2727 1.2039 1.2249 1.2494 1.1527 1.1479 1.2265 1.1393 1.2114 1.1183 1.4478 1.4127 1.3891 1.4430 1.3699 1.3843 1.3390 1.4187 1.3816 1.3874 1.3182 1.3564 1.3334 1.3979 1.4617 1.4636 1.4258 1.1674 1.1246 1.1214 1.1133 1.1395 1.1246 1.1083 1.3017 1.1172 1.1693 1.0979 1.0954 1.7565 1.1777 1.4951 1.5995 1.2131 1.2110 1.1450 1.1001 1.1331 1.3024 1.7923 1.5723 1.1011 2.0599 2.1285 1.0355 1.0418 6.9302 6.4628 7.0355 7.1852 7.7832 1.0604 1.0621 1.0605 1.0611 1.0647 1.0664 1.0668 1.0624 1.0644 1.0418 1.0945 1.0691 1.0740 1.0835 1.0960 1.0700 1.0811 1.0977 1.0637 1.0643 1.0956 1.0634 1.0690 1.0690 1.0999 1.1022 1.0983 1.0598 1.0990 1.1031 1.1023 1.1050 1.0968 1.0999 1.0985 1.1041 1.0964 1.1004 1.1108 1.0911 1.1031 1.0310 1.0937 1.0943 1.0779 1.0785
irintensity: 16.0059 7.1077 14.8861 11.2954 5.7200 4.3163 15.9044 6.9069 4.3971 0.1708 4.7629 11.4765 14.3096 9.0662 4.9026 0.9076 5.8335 0.5098 0.5919 7.7306 17.1750 3.5329 3.5367 5.0240 0.8563 3.0877 0.6725 4.4159 2.7990 2.5650 6.0837 1.9928 28.4513 6.1206 4.3993 21.0848 2.8759 0.8742 0.9158 3.8214 26.8884 7.7568 4.9498 8.4042 12.9898 5.6375 16.4202 18.5152 3.1569 4.8728 9.8416 25.0451 10.8661 7.8423 46.0439 169.4090 145.2663 39.0696 66.4433 29.3053 68.0143 102.7819 42.6012 52.1452 2.7585 55.5997 75.6249 16.3060 8.1051 11.2816 103.7854 99.7522 49.8868 34.3185 32.4906 113.5223 29.3052 87.8715 47.3872 17.7878 44.0782 7.5429 110.6515 28.0103 40.2809 60.9883 12.5679 6.6176 9.2746 33.7194 8.2284 1.0122 20.3339 4.4069 33.4807 3.7688 9.3857 30.7212 8.4070 21.4542 28.9941 38.7131 36.1523 46.3811 43.2418 48.8063 9.2017 11.5971 81.7769 37.9919 15.4781 53.3130 63.7871 34.0564 24.4534 20.0378 0.6992 18.6383 46.3945 26.2975 3.0433 17.3326 5.0943 14.1668 21.9169 5.8025 32.3965 56.4557 36.6305 52.5280 33.9382 5.3296 1.3464 15.7286 11.8436 10.5780 43.0372 6.7794 8.2980 29.4601 85.9854 45.4239 57.8568 37.4230 33.9887 21.5788 2.2978 2.9332 3.5409 10.4784 5.9320 2.7947 2.1460 4.0393 12.8634 24.0881 6.9113 38.8131 8.4394 5.9656 16.9082 24.1930 9.3844 14.8938 25.9709 18.3496 24.7324 14.5377 6.1444 7.5917 0.3591 30.8435 132.3414 78.2292 43.4144 11.4128 13.5296 36.6069 11.1499 57.9338 2.4255 182.4181 6.6150 15.0515 155.5097 29.9621 113.5786 151.5549 40.6552 127.8532 35.0106 6.7563 10.3591 14.9036 44.9198 93.9487 24.1362 389.0948 393.3258 70.7868 63.2383 337.3422 343.7681 571.0511 501.1855 551.8059 40.8210 40.5476 16.3337 20.3113 59.5869 58.2698 53.8844 53.1424 27.3803 2.4623 36.0257 17.3085 10.1228 44.2332 15.9753 35.5070 100.1456 26.6860 14.0779 39.5191 42.3814 32.7886 32.8731 37.0062 62.1939 55.9197 110.0002 19.1713 31.7044 6.5473 10.0810 43.4859 4.1378 5.4071 28.3875 22.6815 26.5212 14.1257 20.2099 23.3767 8.6644 66.3309 165.2593 171.1757 88.5567 94.1893
temp: 298.150 k
press: 1.00000 atm
elementType: 8 7 6 8 8 7 6 8 8 7 6 8 6 6 6 6 6 7 6 6 6 7 6 6 6 6 6 8 6 6 6 7 6 6 6 6 6 8 6 1 1 1 1 1 1 1 1 1 1 1 1 1 1 1 1 1 1 1 1 1 1 1 1 1 1 1 1 1 1 1 1 1 1 1 1 1 1 1 1 1 1 1 1 1 1 13
symmnumber: 1
zpe: 1962604.1 jmol-1
zpe.correction: 0.747516 hartree
zpe.thermalcorrener: 0.788400 hartree
zpe.thermalcorrenthalpy: 0.789344 hartree
zpe.thermalcorrgfe: 0.674514 hartree
zpe.sumelectzpe: -2152.613967 hartree
zpe.sumelectthermal: -2152.573083 hartree
zpe.sumelectthermalent: -2152.572139 hartree
zpe.sumelectthermalfe: -2152.686968 hartree
dipole: 37.8288 -8.8645 15.7577
dipole: 41.9273
quadrupole: 56.8118 -155.6231 -221.3850
quadrupole: -30.7925 61.5152 -8.7446
quadrupole: 163.5439 -48.8910 -114.6529 -30.7925 61.5152 -8.7446
hfenergy: -2153.361483 hartree
pointgroup: C01 [X(C25H46Al1N6O8)]
dipole: 15.1029281 -6.3117718 -2.0406537 debye
polarizability: 453.3530822|-9.771438|459.8277122|-1.3206289|-7.2297208|486.2612806 unknown
InChI: InChI=1S/C25H46N6O8.Al/c1-21(32)29(37)18-9-3-6-16-27-22(33)12-14-25(36)31(39)20-10-4-7-17-28-23(34)11-13-24(35)30(38)19-8-2-5-15-26;/h27-28H,2-20H2,1,26H3;/q-6;+6
charge 1 multiplicity 1
86 atoms
O  20.3627134 4.57908479 3.15692967
N  21.47423656 4.13811685 3.84198102
C  21.34560014 2.99567224 4.48926595
O  20.19144165 2.42243886 4.45289931
O  18.35974333 4.55065219 5.02935642
N  17.36446021 3.94824335 5.7667187
C  16.96299379 2.76194627 5.34694307
O  17.46912641 2.32190696 4.24699424
O  17.77569639 4.50545212 2.35381382
N  17.54053092 3.82125451 1.18242802
C  18.15922513 2.66173055 1.04881879
O  18.9587829 2.3009318 1.99448705
C  22.63743947 5.004458 3.6874276
C  23.24214982 4.89476885 2.28281952
C  23.79978498 3.50428493 1.95195
C  25.07872503 3.15815905 2.72551291
C  25.49632656 1.71797546 2.47247465
N  26.74908943 1.38958429 3.23967091
C  22.46633298 2.32774091 5.23382787
C  21.99426464 1.7825766 6.58353322
C  21.50402499 2.88826138 7.51004944
N  21.21373797 2.49602195 8.76934485
C  20.52289342 3.34210737 9.73919338
C  19.04242041 2.97352562 9.89725768
C  18.19532851 3.10104263 8.62397845
C  18.07713161 4.53243279 8.08600031
C  17.01973269 4.67519013 6.98854702
O  21.39336782 4.0647621 7.12181787
C  16.01690766 1.890547 6.1300755
C  15.11770435 1.02584626 5.23566092
C  13.98590152 1.83739873 4.62605499
N  13.86992992 1.79648859 3.28222762
C  12.90574612 2.62931107 2.56187854
C  13.24925753 4.12718238 2.58952993
C  14.69849739 4.44094258 2.20231686
C  15.07839664 3.96898811 0.79375459
C  16.48153925 4.3906055 0.34884479
O  13.19397757 2.46856784 5.34883735
C  17.9480931 1.76286794 -0.12592285
H  23.36152791 4.75918917 4.46332805
H  22.28346647 6.02184345 3.87419914
H  24.03256641 5.65012035 2.20018355
H  22.466567 5.16175759 1.55771157
H  24.0085045 3.44880016 0.87737991
H  23.03112412 2.7473644 2.15543316
H  25.88825634 3.83432562 2.42331841
H  24.93033509 3.29454816 3.80257201
H  25.71587869 1.53116007 1.41972062
H  24.73316444 1.01230498 2.8063639
H  27.03538959 0.417349 3.09041519
H  27.52314836 1.99706313 2.95267871
H  26.60460826 1.52801419 4.2452373
H  22.80944178 1.23486576 7.06650129
H  21.17451231 1.070777 6.44112236
H  21.24507609 1.50262279 8.96533719
H  20.64097385 4.37530915 9.40970746
H  21.02769108 3.24673508 10.70578456
H  18.97938917 1.94174796 10.26628871
H  18.62268484 3.61334923 10.68431178
H  18.60425776 2.44926301 7.84132509
H  17.19005824 2.72064636 8.84411796
H  19.0399965 4.87883057 7.69874376
H  17.78883422 5.21299086 8.89692113
H  16.91202533 5.7201773 6.68706228
H  16.04597024 4.32575639 7.33459544
H  16.64528783 1.23667493 6.74570372
H  15.40173552 2.47691485 6.81290115
H  14.64824112 0.26227661 5.86394737
H  15.71066959 0.5149097 4.47428565
H  14.65376056 1.42935071 2.75812115
H  11.91788029 2.46917743 3.00241992
H  12.869351 2.25773086 1.53567405
H  13.06096315 4.50937559 3.59822455
H  12.55338857 4.64157672 1.91458698
H  15.37119195 3.98304056 2.93426082
H  14.8605826 5.52350045 2.27423124
H  14.37006391 4.37881729 0.06200954
H  15.00998202 2.87658472 0.72062895
H  16.66202548 4.09433951 -0.68532493
H  16.60840138 5.47436065 0.41290004
H  18.87844612 1.22385998 -0.31594164
H  17.17281957 1.02825061 0.11876905
H  17.64732708 2.29627544 -1.02751156
H  22.81443161 1.49429218 4.61247699
H  23.30835585 3.00322243 5.37252331
Al 18.85883401 3.48864953 3.53113013
