program: Gaussian 16
title: TS; 1-[B10Cl9-N2](1-); 2-[B10Cl9-N2](1-)
version: AS64L-G16RevC.01
frameworkgroup: C1[X(B10Cl9N2)]
method: RB3LYP
basis: def2QZVPP
operation: Freq
keyword: #P
keyword: Geom=AllCheck
keyword: Guess=TCheck
keyword: SCRF=Check
keyword: GenChk
keyword: RB3LYP/def2QZVPP
keyword: Freq
converged: YES YES YES YES
title: Mulliken charges:
elementType: B B B B B B B B B B Cl Cl Cl Cl Cl Cl Cl Cl Cl N N
charge: 0.283511 -0.021659 0.173656 0.042275 0.410895 0.046020 0.223764 -0.005563 0.138930 0.193695 -0.298750 -0.286877 -0.284016 -0.250484 -0.306542 -0.294990 -0.250634 -0.280582 -0.304453 0.072005 -0.000201
chargesum: -1.00000
title: Mulliken charges with hydrogens summed into heavy atoms:
polarizability: 2.94273109e+02 1.70362499e+01 2.96066112e+02 4.76820807e+00 5.42757361e+00 2.57111550e+02
1716.lowfreq: -111.5035 -1.7419 -1.0319 -0.6046 0.0018 0.0021 0.0037 67.6779 72.8163
frequency: -111.5035 67.6779 72.8163 76.3270 83.8105 97.7731 101.8260 105.7099 109.9560 111.5339 113.1256 114.5830 118.0728 124.4675 127.7404 140.7405 148.4332 179.4925 246.1458 279.1406 298.7032 303.3763 314.3608 325.8248 349.1066 361.6842 407.3546 437.8201 452.9270 485.6938 503.0967 530.7042 544.9401 557.9054 568.1764 580.1738 595.9489 608.2633 633.4789 653.5252 662.0805 677.0063 734.9830 782.9747 786.4773 890.2433 931.6045 944.1209 972.2815 987.4749 998.2718 1031.9354 1047.9364 1074.6527 1082.1355 1101.6758 2291.0617
redmass: 20.3646 17.5548 32.0335 17.1651 24.9213 33.9733 34.1871 33.8485 33.8575 34.3697 34.6054 34.2006 34.5208 34.1218 27.3054 24.8895 24.2344 22.1254 23.3626 24.7652 27.8052 25.5883 28.6396 21.5433 14.4835 13.1492 11.9030 11.8754 12.3441 12.8118 12.9896 13.1490 12.0646 12.6467 12.2348 11.6167 12.1787 11.6214 11.4703 11.5469 11.2972 11.6051 11.6021 11.4225 11.4044 11.2419 11.5180 11.5147 11.3776 11.3258 11.2584 11.2461 11.3149 11.2974 11.3757 11.2358 14.0003
irintensity: 1.0233 0.2913 0.0691 0.3473 0.0950 0.3756 0.0317 0.0366 0.2659 0.0244 0.0302 0.0474 0.0563 0.0481 0.4257 1.0601 0.2682 0.9732 0.7173 0.0460 1.2717 0.7656 0.0590 4.7598 6.4576 1.6553 12.6406 5.1353 4.7253 7.6904 9.4949 61.9453 8.3376 25.1007 23.5978 11.6985 10.3245 62.7650 8.4722 8.6360 0.7948 10.3393 2.8951 15.3549 1.2154 30.0016 3.3659 46.2115 155.5217 67.8490 33.8614 173.6294 181.1937 416.5931 160.7904 53.1597 767.6117
temp: 298.150 k
press: 1.00000 atm
elementType: 5 5 5 5 5 5 5 5 5 5 17 17 17 17 17 17 17 17 17 7 7
symmnumber: 1
zpe: 173036.0 jmol-1
zpe.correction: 0.065906 hartree
zpe.thermalcorrener: 0.087903 hartree
zpe.thermalcorrenthalpy: 0.088848 hartree
zpe.thermalcorrgfe: 0.014051 hartree
zpe.sumelectzpe: -4500.945421 hartree
zpe.sumelectthermal: -4500.923423 hartree
zpe.sumelectthermalent: -4500.922479 hartree
zpe.sumelectthermalfe: -4500.997276 hartree
dipole: 2.3082 3.2174 1.5105
dipole: 4.2381
quadrupole: -214.3686 -204.9334 -207.0276
quadrupole: 4.7427 1.0649 2.6520
quadrupole: -5.5921 3.8431 1.7489 4.7427 1.0649 2.6520
hfenergy: -4501.0113268 hartree
pointgroup: C01 [X(B10Cl9N2)]
dipole: 0.9081203 1.2658316 0.5942848 debye
dipolederiv: 1.3013178 -0.2822183 -0.0855986 -0.2340213 -0.1661188 -0.0796366 0.0375441 -0.0793661 -0.1844018 -0.0432774 0.0483378 0.4693134 0.1222172 -0.140816 0.2203137 0.5794859 0.2369289 0.7431516 0.0797654 -0.0185708 -0.2560723 -0.2471019 0.4715056 0.5908319 -0.4141336 0.4886475 0.7897259 0.1550335 -0.1102501 0.0999415 -0.3273797 0.650253 -0.5501173 0.0698984 -0.3956372 0.2807963 0.3094035 0.7569588 -0.2016621 0.7208472 0.8031936 0.0117655 -0.0542265 0.0034188 -0.074064 0.2926087 0.1090678 -0.5017478 0.2694014 0.1306247 -0.1451908 -0.4318111 -0.073994 0.6866033 -0.8067756 -0.3841393 -0.027941 -0.425339 -0.6560565 -0.1445674 -0.0790378 -0.2252281 -0.1731892 0.1982932 -0.2269792 -0.1956958 -0.1998516 0.7262377 0.4581266 -0.1586069 0.4174924 0.3543006 -0.1195332 -0.2977437 0.232667 -0.2895757 0.504511 -0.6144197 0.123037 -0.6470496 0.6909691 1.0166892 -0.4726219 0.2228939 -0.3654559 -0.0573928 0.0114859 0.1054606 0.0936395 -0.1084311 -0.9505533 0.2074505 -0.1396079 0.1598634 -0.1852574 0.0346145 -0.09297 0.0392225 -0.173572 -0.3389294 -0.0676465 0.3753975 -0.0929125 -0.1792014 0.163126 0.3084495 0.1007587 -0.6624302 -0.2250508 0.2674089 0.1257556 0.2341217 -0.7699384 -0.3005635 0.1574042 -0.4117197 -0.3036449 -0.0830568 0.1214287 -0.1001452 0.1285471 -0.4478499 0.4149941 -0.1074347 0.4838039 -0.8083928 -0.5077635 -0.4513588 0.0467944 -0.5041591 -0.7542772 0.0557838 0.0115182 0.0432459 -0.1522106 -1.1014394 0.1345887 0.0389568 0.2187534 -0.1762133 -0.0077338 0.0105561 -0.0192551 -0.1520686 -0.1523065 0.1070161 0.1679139 0.198252 -0.4068802 -0.4272937 0.2702296 -0.3631183 -0.779464 -0.1859334 0.144929 -0.0750954 0.2454906 -0.7455423 0.3237972 -0.1394629 0.3718684 -0.2928811 -0.284425 -0.0556876 -0.3042776 -0.0604999 -0.1759933 -0.1035907 -0.3233345 -0.1264499 -0.7656688 1.1388308 1.2795563 0.2973928 1.3801086 1.631264 0.2991804 0.417675 0.3451766 0.1477655 -0.6928978 -0.8095266 -0.1891829 -0.9313061 -1.0560519 -0.2109062 -0.2902405 -0.2823851 -0.0628932 unknown
polarizability: 294.2730912|17.036249|296.0661292|4.7682053|5.4275761|257.1115499 unknown
InChI: InChI=1S/B10Cl9N2/c11-1-3(13)4(14)2(12)6(21-20)5(1,15)7(1,3,16)9(3,4,18)8(2,4,6,17)10(5,6,7,9)19
charge -1 multiplicity 1
21 atoms
B  -1.63781 0.353577 0.258912
B  -0.798286 -0.282866 -1.142944
B  -0.507574 1.093369 1.259906
B  -0.456299 1.36898 -0.534315
B  -1.005067 -1.293439 0.277293
B  0.978113 0.337174 -1.022991
B  0.970857 1.225883 0.469903
B  0.540493 -1.323891 -0.548237
B  0.394601 -1.14448 1.236865
B  1.657713 -0.365631 0.435429
Cl 3.417318 -0.632227 0.67038
Cl 1.938082 0.778627 -2.463852
Cl 1.14275 -2.810587 -1.326942
Cl 0.552699 -1.948283 2.793664
Cl -2.144684 -2.663836 0.399977
Cl -3.390582 0.68028 0.342032
Cl -0.890394 1.920071 2.768724
Cl -0.87175 2.9248 -1.310769
Cl -1.567531 -0.545122 -2.736711
N  1.829733 2.36744 0.689918
N  2.478245 3.231608 0.914416
