program: Gaussian 16
title: [B10I9-H2O](1-) 2-H2O_2
version: ES64L-G16RevC.01
frameworkgroup: CS[SG(B4I3O),X(B6H2I6)]
method: RB3LYP
basis: def2QZVPP
operation: Freq
keyword: #P
keyword: Geom=AllCheck
keyword: Guess=TCheck
keyword: SCRF=Check
keyword: GenChk
keyword: RB3LYP/def2QZVPP
keyword: Freq
converged: YES YES YES YES
title: Mulliken charges:
elementType: B B B B B B B B B B I I I I I I I I I O H H
charge: -1.212769 0.332201 0.332201 0.374678 0.261726 0.298482 0.374678 0.471254 0.261726 0.078674 -0.312322 -0.316076 -0.327740 -0.327740 -0.291515 -0.312322 -0.210538 -0.291515 -0.208110 -0.444043 0.234535 0.234535
chargesum: -1.00000
title: Mulliken charges with hydrogens summed into heavy atoms:
elementType: B B B B B B B B B B I I I I I I I I I O
charge: -1.212769 0.332201 0.332201 0.374678 0.261726 0.298482 0.374678 0.471254 0.261726 0.078674 -0.312322 -0.316076 -0.327740 -0.327740 -0.291515 -0.312322 -0.210538 -0.291515 -0.208110 0.025027
polarizability: 4.18497793e+02 1.70422980e+00 4.65150911e+02 -1.78650100e-08 -4.32432432e-09 4.44115661e+02
1716.lowfreq: -0.0001 0.0002 0.0002 0.1958 0.6574 0.7786 40.0705 40.7096 47.1203
frequency: 40.0705 40.7096 47.1203 47.1932 52.1623 54.1665 57.4818 59.1925 61.8376 63.3610 63.4837 66.1292 73.5144 73.7163 82.8949 139.0716 140.2141 145.9167 146.8473 147.8050 150.7166 176.3561 208.0906 296.4017 326.6295 355.2695 368.6799 369.1745 393.7510 403.9160 425.6658 493.5578 528.2235 540.7810 542.5722 548.3154 604.1677 620.8773 666.6940 670.3323 685.9282 687.8997 723.6475 824.3068 829.8130 838.3119 853.4882 874.9118 924.0751 935.7238 940.7876 955.1427 977.8756 1014.5998 1088.2112 1099.8895 1127.1101 1625.1837 3263.1774 3281.8191
redmass: 124.2409 114.2622 124.3634 98.7302 121.3484 105.4800 120.0920 110.0928 106.6755 122.0624 107.2837 123.9156 63.2988 74.5355 63.1751 87.5642 84.6970 106.4436 109.6095 110.3204 114.8035 5.7864 5.8914 9.8920 1.0631 8.7789 12.4041 12.2053 7.7810 8.2378 9.7301 9.3781 10.3585 10.1681 9.0115 10.8600 10.1352 9.4542 8.8904 10.3402 9.7853 10.2856 10.9053 10.0848 7.9581 10.7431 11.0159 10.3594 4.5715 7.3447 8.5945 11.0183 1.6981 10.4630 10.4151 1.2867 8.3016 1.0687 1.0848 1.0447
irintensity: 0.0015 0.0152 0.0054 0.0072 0.0002 0.0026 0.0048 0.0192 0.0124 0.0146 0.0148 0.0058 0.0366 0.1532 0.2331 0.0525 0.3566 0.0548 0.0004 0.0001 0.0063 8.1731 15.7582 7.1669 4.4053 1.0131 8.3583 7.1641 1.7394 6.4517 0.1410 9.2658 0.2583 0.0346 0.1887 2.2796 9.8431 0.6943 0.0168 0.7580 0.2289 7.2709 1.3156 62.2695 36.6794 2.4226 2.5401 13.9628 131.2907 92.1308 35.8332 40.8603 247.3010 72.9253 83.0234 6.0245 36.4453 31.2818 407.3333 261.1341
temp: 298.150 k
press: 1.00000 atm
elementType: 5 5 5 5 5 5 5 5 5 5 53 53 53 53 53 53 53 53 53 8 1 1
symmnumber: 1
zpe: 202437.8 jmol-1
zpe.correction: 0.077104 hartree
zpe.thermalcorrener: 0.102585 hartree
zpe.thermalcorrenthalpy: 0.103529 hartree
zpe.thermalcorrgfe: 0.012563 hartree
zpe.sumelectzpe: -3005.905823 hartree
zpe.sumelectthermal: -3005.880342 hartree
zpe.sumelectthermalent: -3005.879398 hartree
zpe.sumelectthermalfe: -3005.970364 hartree
dipole: 5.0723 -1.3953 -0.0000
dipole: 5.2607
quadrupole: -319.5573 -350.3501 -340.0171
quadrupole: -5.2292 0.0000 -0.0000
quadrupole: 17.0842 -13.7086 -3.3756 -5.2292 0.0000 -0.0000
hfenergy: -3005.982927 hartree
pointgroup: CS [SG(B4I3O1),X(B6H2I6)]
dipole: -0.5489368 0. -1.9955795 debye
dipolederiv: -0.0156097 0. 0.0283528 0. -0.0414673 0. 0.2326679 0. 0.425819 0.0135475 0.2669386 0.3766736 0.2180296 0.1594496 0.4214223 0.2543364 0.3186499 0.20648 0.0135475 -0.2669386 0.3766736 -0.2180296 0.1594496 -0.4214223 0.2543364 -0.3186499 0.20648 -0.0569856 -0.3258223 -0.0586342 -0.3181473 0.6099396 0.1809858 -0.0623827 0.0829367 -0.1118138 -0.148742 0.1284257 -0.1111656 0.1284577 0.2390483 -0.4696652 -0.1128022 -0.4580303 0.3798297 0.7457975 0. -0.3120818 0. -0.2303547 0. -0.3085506 0. -0.1824289 -0.0569856 0.3258223 -0.0586342 0.3181473 0.6099396 -0.1809858 -0.0623827 -0.0829367 -0.1118138 0.7086204 0. -0.4418881 0. -0.2208924 0. -0.3066847 0. -0.0458246 -0.148742 -0.1284257 -0.1111656 -0.1284577 0.2390483 0.4696652 -0.1128022 0.4580303 0.3798297 0.1907675 0. 0.4958708 0. -0.1584898 0. 0.4834508 0. 0.4015452 -0.0982491 0.077372 0.0712215 0.0723561 -0.330246 -0.2651422 0.0707589 -0.2644713 -0.3748294 -0.3168003 0. -0.2730638 0. -0.0899616 0. -0.2729472 0. -0.3704718 -0.2537593 -0.2416336 -0.1351195 -0.2235003 -0.28521 -0.1679917 -0.1308999 -0.1603186 -0.3561408 -0.2537593 0.2416336 -0.1351195 0.2235003 -0.28521 0.1679917 -0.1308999 0.1603186 -0.3561408 -0.1591728 0.1965534 0.0221679 0.2009417 -0.571657 -0.0856904 0.0144915 -0.0681217 -0.1200772 -0.0982491 -0.077372 0.0712215 -0.0723561 -0.330246 0.2651422 0.0707589 0.2644713 -0.3748294 -0.604012 0. 0.1210625 0. -0.095362 0. 0.1334741 0. -0.1125515 -0.1591728 -0.1965534 0.0221679 -0.2009417 -0.571657 0.0856904 0.0144915 0.0681217 -0.1200772 -0.5833296 0. 0.1890826 0. -0.0783023 0. 0.190162 0. -0.1802738 -0.4405384 0. 0.1115285 0. -0.5708604 0. -0.1294967 0. -0.7425374 0.3609137 -0.1995505 -0.1245755 -0.2387929 0.4215208 0.0244722 -0.0445398 -0.0277506 0.2799133 0.3609137 0.1995505 -0.1245755 0.2387929 0.4215208 -0.0244722 -0.0445398 0.0277506 0.2799133 unknown
polarizability: 465.1509107|0.|444.1156608|-1.7042298|0.|418.4977927 unknown
InChI: InChI=1S/B10H2I9O/c11-1-3(13)4(1,14)5(3,15)2(12)8(3,5,18)6(1,3,16)7(1,4,17)9(2,4,5,19)10(2,6,7,8)20/h20H2
charge -1 multiplicity 1
22 atoms
B  0.38175351 0.0000 -1.61835449
B  -0.9476589 -0.90756491 -0.8592099
B  -0.9476589 0.90756491 -0.8592099
B  0.76816379 -1.30744602 -0.42963306
B  -0.43364218 -0.92302463 0.88525359
B  -1.73164399 0.0000 0.30803764
B  0.76816379 1.30744603 -0.42963306
B  1.79456854 0.0000 -0.75054091
B  -0.43364218 0.92302463 0.88525359
B  1.14466137 0.0000 0.80291748
I  -0.81902014 2.33913153 2.47394106
I  2.52530705 0.0000 2.46753277
I  -2.01403641 -2.18921832 -2.27776724
I  -2.01403641 2.18921833 -2.27776724
I  1.53252614 -3.31748614 -0.7001765
I  -0.81902014 -2.33913153 2.47394106
I  -3.80615399 0.0000 0.84668078
I  1.53252615 3.31748614 -0.7001765
I  3.80150188 -0.0000 -1.50400377
O  0.34463509 0.0000 -3.14433955
H  -0.20178104 0.78748962 -3.40240793
H  -0.20178104 -0.78748962 -3.40240793
