program: Gaussian 16
title: B10I9 meta OC
version: ES64L-G16RevC.01
frameworkgroup: C1[X(CB10I9O)]
method: RB3LYP
basis: def2QZVPP
operation: Freq
keyword: #N
keyword: Geom=AllCheck
keyword: Guess=TCheck
keyword: SCRF=Check
keyword: GenChk
keyword: RB3LYP/def2QZVPP
keyword: Freq
converged: YES YES YES YES
title: Mulliken charges:
elementType: B B B B B B B B B B I I I I I I I I I O C
charge: 0.265799 0.165435 0.412009 0.412010 0.165435 0.401301 -1.295115 0.144245 0.401299 0.475523 -0.307028 -0.307027 -0.267210 -0.312822 -0.287877 -0.312822 -0.267210 -0.178516 -0.197171 -0.394168 0.283911
chargesum: -1.00000
title: Mulliken charges with hydrogens summed into heavy atoms:
1716.lowfreq: -2.5302 -2.0186 -1.4759 -0.0003 0.0002 0.0003 32.8251 39.1926 40.7988
frequency: 32.8251 39.1926 40.7987 40.8824 45.5835 48.0201 52.1360 52.4028 59.0729 59.9973 62.6057 63.4498 64.9800 66.3585 73.5903 74.3994 80.1299 139.2733 139.5675 146.5583 146.7883 149.1042 151.1981 209.8063 242.0396 257.5103 354.4649 370.1930 370.8999 394.5980 412.5489 422.0936 423.6397 510.6059 532.0104 540.6927 542.0734 595.6421 629.5663 653.7393 661.6981 688.6913 689.3199 693.1134 815.9506 823.5500 840.4619 846.3831 855.1783 919.9619 928.5258 939.0526 946.1534 954.0296 1069.7600 1091.0225 2048.1815
redmass: 16.8233 22.6597 55.3615 40.9261 92.3577 39.2370 91.6483 124.3007 117.7128 86.4634 108.3104 125.7235 102.3109 123.8638 78.2848 64.9271 62.3927 102.3112 96.0415 112.1683 110.6922 114.8712 115.2782 15.5365 15.3483 15.3933 11.2335 12.3788 11.9795 11.7575 12.1257 12.3707 11.2805 11.0600 11.0485 11.0750 11.1045 11.0397 11.0186 11.0521 11.0769 11.1513 11.1162 11.1544 11.0332 11.0850 11.0601 11.0815 11.0831 11.0831 11.0351 11.0496 11.0330 11.0273 11.0436 11.0428 13.4383
irintensity: 1.7214 0.4457 0.2852 0.1745 0.0647 0.2427 0.1246 0.0004 0.0100 0.1199 0.0222 0.0001 0.0141 0.0088 0.1706 0.2159 0.1947 0.0004 0.0012 0.0229 0.0005 0.0002 0.0158 0.1781 1.1309 4.4988 0.0138 6.8679 4.3789 5.5753 8.2813 1.4359 5.2727 2.2441 0.2394 2.9506 0.6375 5.8541 3.8458 1.5336 2.7652 7.5279 3.6105 6.2367 40.4677 41.4151 14.4670 1.4676 13.0907 0.7474 87.6410 106.2025 21.1258 8.3780 32.7283 143.3708 7.6779
temp: 298.150 k
press: 1.00000 atm
elementType: 5 5 5 5 5 5 5 5 5 5 53 53 53 53 53 53 53 53 53 8 6
symmnumber: 1
zpe: 150143.7 jmol-1
zpe.correction: 0.057187 hartree
zpe.thermalcorrener: 0.084004 hartree
zpe.thermalcorrenthalpy: 0.084948 hartree
zpe.thermalcorrgfe: -0.010539 hartree
zpe.sumelectzpe: -3042.760464 hartree
zpe.sumelectthermal: -3042.733647 hartree
zpe.sumelectthermalent: -3042.732703 hartree
zpe.sumelectthermalfe: -3042.828189 hartree
dipole: -1.1957 0.0000 -3.8518
dipole: 4.0332
quadrupole: -351.6472 -344.7282 -328.1302
quadrupole: -0.0000 1.8308 -0.0000
quadrupole: -10.1453 -3.2264 13.3717 -0.0000 1.8308 -0.0000
hfenergy: -3042.8176506 hartree
pointgroup: C01 [X(C1B10I9O1)]
dipole: 0.4486077 -0.0000011 -1.5220285 debye
dipolederiv: 0.8395179 0. -0.3241999 -0.0000001 -0.2339991 0.0000002 -0.3034145 0. -0.1715636 -0.1851615 0.1741795 -0.1261688 0.1480546 0.2212447 -0.4798543 -0.1447352 -0.465226 0.3341683 0.055338 -0.2714574 0.2963927 -0.2479768 0.2131348 -0.2914002 0.2930207 -0.3650327 0.1872251 0.055338 0.2714574 0.2963926 0.2479769 0.2131341 0.2913997 0.2930214 0.3650327 0.1872246 -0.1851613 -0.1741795 -0.1261688 -0.1480544 0.2212445 0.4798546 -0.1447354 0.4652261 0.3341689 -0.0764134 -0.3258644 -0.0373778 -0.3183066 0.5879321 0.0730675 -0.068226 0.0663024 -0.0767588 0.024903 -0.0000002 -0.0442824 -0.0000004 0.0233304 0.0000012 0.0351132 0.0000008 -0.2323173 0.220712 -0.0000003 0.4168464 -0.0000003 -0.1348786 -0.0000001 0.4429301 -0.0000001 0.5463576 -0.0764131 0.3258643 -0.0373779 0.3183069 0.5879326 -0.0730681 -0.0682258 -0.0663019 -0.0767592 0.7033177 0.0000003 -0.174615 0.0000001 -0.2113003 0.0000001 -0.2352475 -0.0000003 -0.1255818 -0.2293552 0.1839117 -0.1508011 0.1928364 -0.292596 0.1836662 -0.1753153 0.2126249 -0.2916872 -0.2293553 -0.1839115 -0.1508007 -0.1928364 -0.2925956 -0.1836658 -0.1753153 -0.2126248 -0.2916873 -0.1454741 0.1977591 0.0178608 0.1994265 -0.5531267 -0.04895 0.0224842 -0.0625252 -0.1032258 -0.0996801 -0.0862785 0.0903739 -0.0833316 -0.3280964 0.2679322 0.0873684 0.2623419 -0.3748132 -0.2982726 0. -0.2914474 0. -0.0794155 0. -0.2673019 0. -0.4356684 -0.09968 0.0862785 0.090374 0.0833316 -0.328096 -0.2679322 0.0873684 -0.262342 -0.3748134 -0.1454741 -0.1977592 0.0178607 -0.1994264 -0.5531267 0.04895 0.0224841 0.062525 -0.1032256 -0.5573314 -0.0000002 0.1045572 -0.0000001 -0.0590061 0. 0.1694659 0. -0.161733 -0.6343436 0. 0.1386133 0. -0.0826068 0. 0.127903 0. -0.1054945 -0.1495664 0.0000003 0.0181674 0.0000005 -0.0174198 -0.0000025 0.1445026 -0.0000044 0.0437369 0.2125555 -0.0000002 -0.0241991 -0.0000003 0.0983103 0.0000015 -0.1431452 0.0000036 0.2924478 unknown
polarizability: 469.7554632|0.0000005|446.6857392|-4.8505441|0.0000425|452.9223538 unknown
InChI: InChI=1S/CB10I9O/c1-21-11-3(13)6(16)4(14)2(12)5(4,6,15)8(2,11,18,10(3,5,6,11)20)7(2,4,11,17)9(3,4,6,11)19
charge -1 multiplicity 1
21 atoms
B  -1.74542633 0.00000023 0.24071166
B  -0.47453793 -0.92568312 0.87061651
B  -0.93545627 0.92323837 -0.90399901
B  -0.93545626 -0.92323732 -0.90399951
B  -0.47453795 0.92568317 0.87061705
B  0.78214738 -1.3162408 -0.36995958
B  0.42662621 0.00000078 -1.54853395
B  1.10303141 0.00000007 0.87200157
B  0.78214733 1.31624163 -0.36995887
B  1.82050971 0.00000052 -0.64759877
I  -1.99169318 2.25800882 -2.24444808
I  -1.99169317 -2.25800709 -2.24444925
I  1.57081066 -3.31162281 -0.62989694
I  -0.91795878 -2.34317573 2.44267812
I  2.42195385 -0.00000045 2.58258563
I  -0.91795888 2.34317473 2.44267958
I  1.57081057 3.31162389 -0.62989462
I  3.82676585 0.0000006 -1.39613849
I  -3.82878262 0.00000008 0.73394811
O  0.62611117 0.00000024 -3.05316512
C  0.86787355 -0.00000579 -4.16673153
