program: Gaussian 16
title: B10I9_para_H2O (1-) Cs
version: ES64L-G16RevC.01
frameworkgroup: C1[X(B10H2I9O)]
method: RB3LYP
basis: def2QZVPP
operation: Freq
keyword: #N
keyword: Geom=AllCheck
keyword: Guess=TCheck
keyword: SCRF=Check
keyword: GenChk
keyword: RB3LYP/def2QZVPP
keyword: Freq
converged: YES YES YES YES
title: Mulliken charges:
elementType: B B B B B B B B B B I I I I I I I I I O H H
charge: -0.376199 0.249095 0.116671 0.116654 0.249083 0.270760 0.292475 0.209244 0.270768 0.265938 -0.293845 -0.335937 -0.338046 -0.208813 -0.338047 -0.342680 -0.303398 -0.303397 -0.293846 -0.409590 0.251554 0.251555
chargesum: -1.00000
title: Mulliken charges with hydrogens summed into heavy atoms:
elementType: B B B B B B B B B B I I I I I I I I I O
charge: -0.376199 0.249095 0.116671 0.116654 0.249083 0.270760 0.292475 0.209244 0.270768 0.265938 -0.293845 -0.335937 -0.338046 -0.208813 -0.338047 -0.342680 -0.303398 -0.303397 -0.293846 0.093519
1716.lowfreq: -2.6553 0.0001 0.0002 0.0003 0.6357 0.7022 41.1891 42.7111 43.8967
frequency: 41.1891 42.7111 43.8966 47.0076 48.3692 51.9690 52.9518 57.5052 59.9479 61.4359 62.1854 63.0585 70.9760 71.7275 83.4467 137.3857 137.4570 144.3926 148.7243 149.0912 149.0989 171.7927 173.3402 288.9809 332.6843 358.6656 370.2050 370.3048 387.5976 388.6124 410.4515 516.4785 525.7576 529.2637 540.6198 542.2781 605.5197 615.9787 649.0037 672.2757 682.4054 689.8997 746.4671 838.4095 840.5156 844.7233 856.9994 863.4816 903.6792 923.1146 929.1187 935.8023 956.9451 1021.4575 1069.9867 1131.2921 1221.1167 1622.4643 3324.6515 3324.7131
redmass: 118.7009 114.4830 116.4130 126.0501 117.9490 121.3065 120.4629 104.8455 114.5542 116.7703 121.9158 109.6428 71.6701 75.5739 51.5015 100.5710 102.7603 107.2912 111.2209 105.4703 103.4501 5.4180 5.3129 10.4592 1.0604 10.4608 12.3576 12.1764 6.5085 8.3915 10.5718 8.5273 10.9904 10.9982 8.2361 9.3800 10.9064 10.5841 10.9118 10.8943 9.7942 9.9475 10.9788 10.6758 10.9827 11.0409 10.9637 10.9925 1.6155 8.4968 8.4518 8.7080 3.0539 4.7790 10.9727 1.6998 9.8501 1.0725 1.0853 1.0442
irintensity: 0.0086 0.0036 0.0005 0.0089 0.0424 0.0270 0.0178 0.0001 0.0039 0.0033 0.0046 0.0187 0.0663 0.1718 0.1129 0.0281 0.0506 0.0142 0.0272 0.0544 0.0171 8.7290 18.0401 7.3117 6.7719 0.1594 7.8920 7.8507 3.0001 8.6170 0.7986 9.5566 0.3587 0.0205 0.0023 11.5900 0.3541 0.3843 0.4766 0.5950 7.1431 0.9745 0.9626 53.0434 35.8571 3.9741 39.7383 43.7109 297.8159 12.0948 102.2451 52.5281 18.1961 44.5303 109.0741 1.1309 27.9908 46.1227 366.8487 183.4616
temp: 298.150 k
press: 1.00000 atm
elementType: 5 5 5 5 5 5 5 5 5 5 53 53 53 53 53 53 53 53 53 8 1 1
symmnumber: 1
zpe: 202776.5 jmol-1
zpe.correction: 0.077233 hartree
zpe.thermalcorrener: 0.102866 hartree
zpe.thermalcorrenthalpy: 0.103810 hartree
zpe.thermalcorrgfe: 0.012204 hartree
zpe.sumelectzpe: -3005.907152 hartree
zpe.sumelectthermal: -3005.881520 hartree
zpe.sumelectthermalent: -3005.880576 hartree
zpe.sumelectthermalfe: -3005.972182 hartree
dipole: 0.0007 -3.0682 5.4814
dipole: 6.2817
quadrupole: -340.9234 -338.1894 -326.3831
quadrupole: -0.0006 0.0021 -9.4758
quadrupole: -5.7581 -3.0241 8.7822 -0.0006 0.0021 -9.4758
hfenergy: -3005.984386 hartree
pointgroup: C01 [X(B10H2I9O1)]
dipole: 2.3525176 -0.551658 0.5187939 debye
dipolederiv: 0.3395776 -0.1335559 0.1277229 -0.0356583 -0.089561 -0.029747 0.0276591 -0.0278579 -0.0913772 0.0479566 0.0100532 -0.3199067 -0.0046266 -0.1217368 0.0067754 -0.4169799 0.0219525 0.6117382 0.1432523 0.0161793 0.3471217 0.0160399 -0.1427479 0.0130994 0.4845878 -0.0035277 0.4589957 0.1270738 -0.3409817 -0.0140101 -0.4787039 0.4747342 -0.0074558 -0.0105855 0.0065395 -0.1423084 0.061799 0.3299112 -0.0203278 0.427549 0.5977068 -0.0016761 -0.0080369 -0.0152551 -0.1215437 -0.0464388 0.2891731 0.2538991 0.2306204 0.2585296 0.3903017 0.2031136 0.3834661 0.2196022 -0.0833312 0.235171 -0.2414858 0.1907707 0.2403017 -0.3945876 -0.1961122 -0.3954403 0.2657586 -0.0302058 -0.2890811 0.2931468 -0.2289865 0.2342253 -0.3895073 0.2317333 -0.3883639 0.2413597 -0.0644643 -0.2470685 -0.2704688 -0.1951507 0.2452594 0.3930306 -0.2129037 0.3997301 0.250897 0.8782293 0.0034382 -0.0251647 0.0078208 -0.2553833 0.0032819 -0.0296376 0.0033583 -0.2548975 -0.2133892 0.0145126 0.2122993 0.0107594 -0.0854908 -0.0027728 0.2057644 -0.0044861 -0.5818164 -0.1709307 0.1548903 -0.1569233 0.1427783 -0.3357917 0.240085 -0.1445431 0.2398544 -0.3406159 -0.1645302 -0.1483919 -0.1457932 -0.1356784 -0.3599055 -0.2402378 -0.1355714 -0.2362021 -0.3201661 -0.6336939 -0.0045038 0.0151112 -0.0050608 -0.0844941 -0.0004962 0.01568 -0.0005072 -0.0848562 -0.1541226 0.1411109 0.1369719 0.1306891 -0.3359629 -0.2420681 0.1244097 -0.2460598 -0.3545205 -0.1473084 -0.1307788 0.1345061 -0.1161372 -0.3413915 0.2451617 0.1195398 0.2454428 -0.3568696 -0.3019218 0.0070745 -0.1765151 -0.0046841 -0.0436449 -0.0026954 -0.1643074 -0.0134273 -0.5527643 -0.2955871 0.1715186 -0.0062213 0.1593757 -0.5593068 -0.0051608 0.0060083 0.005108 -0.0434418 -0.221788 -0.2192726 -0.0072277 -0.2126878 -0.5735975 0.0104583 -0.0035893 0.012223 -0.0853205 -0.7255471 0.0868677 -0.0850926 -0.1041695 -0.4426938 -0.0898447 0.1101672 -0.0935041 -0.4390841 0.3267627 0.0324094 -0.0170061 0.0444862 0.1850243 0.0613768 -0.1568225 0.0527473 0.5369901 0.3286078 0.0213243 -0.0346356 0.1606544 0.5359271 0.0426789 -0.0495736 0.0542096 0.1842406 unknown
polarizability: 435.8266114|-0.7567398|446.6409232|0.9908025|0.5766026|446.582318 unknown
InChI: InChI=1S/B10H2I9O/c11-1-3(12)4(1,13)6(1,15)5(1,3,14)8(3,17)2(20)7(3,4,8,16)9(2,4,6,18)10(2,5,6,8)19/h20H2
charge -1 multiplicity 1
22 atoms
B  2.13065239 0.07323437 -0.09963393
B  1.0913854 0.05083346 -1.38068344
B  1.13167837 0.07673593 1.22241912
B  1.10720819 -1.22921405 -0.05523796
B  1.11617834 1.3741268 -0.08606107
B  -0.40740221 -0.89292894 -0.93452227
B  -0.36930745 -0.86817404 0.91046457
B  -0.41696949 0.96117636 -0.95841953
B  -0.3723583 0.97731541 0.8952602
B  -1.45772427 0.03886343 0.0042251
I  1.98062542 0.00290762 -3.35557431
I  -1.257604 2.3642077 -2.37638031
I  -1.21107049 -2.36308587 -2.30658091
I  -3.60097971 0.02595826 0.05846254
I  -1.12189658 2.39607728 2.3496018
I  -1.06732134 -2.29511753 2.38233192
I  2.28565121 0.10305267 3.07521662
I  2.225563 -3.10390083 -0.06234792
I  2.04301169 3.33220788 -0.09834906
O  3.62312049 -0.0609601 0.00894621
H  3.84022421 0.11652867 0.95846704
H  3.81896172 -1.01808933 -0.15160441
