program: Gaussian 16
title: B10I9_para_Kr (1-)
version: ES64L-G16RevC.01
frameworkgroup: C4V[C4(KrBBI),2SGV(B2I2),2SGD(B2I2)]
method: RB3LYP
basis: def2QZVPP
operation: Freq
keyword: #N
keyword: Geom=AllCheck
keyword: Guess=TCheck
keyword: SCRF=Check
keyword: GenChk
keyword: RB3LYP/def2QZVPP
keyword: Freq
converged: YES YES YES YES
title: Mulliken charges:
elementType: B B B B B B B B B B I I I I I I I I I Kr
charge: -0.785554 0.271614 0.271614 0.271614 0.271614 0.181697 0.181697 0.181697 0.181697 0.331526 -0.284756 -0.328256 -0.328256 -0.205137 -0.328256 -0.328256 -0.284756 -0.284756 -0.284756 0.297966
chargesum: -1.00000
title: Mulliken charges with hydrogens summed into heavy atoms:
1716.lowfreq: 0.0019 0.0025 0.0035 1.7544 1.7544 2.0740 40.8799 40.8799 43.5135
frequency: 40.8798 40.8798 43.5135 44.6834 50.6574 51.9681 51.9681 60.5994 61.8461 61.8461 62.9070 64.6090 66.0598 66.0598 73.5483 73.5483 80.6823 135.1988 137.2363 137.2363 144.0585 148.4649 149.4701 149.8867 343.1583 349.5676 349.5676 357.1121 372.8569 372.8569 408.2517 508.4642 508.4642 530.1763 530.1763 568.9244 601.5896 634.5616 637.4614 652.9323 678.9657 678.9657 805.1086 825.8749 825.8749 841.5048 870.9947 900.2316 932.2597 932.2597 1025.7732 1025.7732 1057.5026 1083.2323
redmass: 117.1829 117.1829 126.4895 126.4875 123.3763 121.9619 121.9619 126.7632 112.8900 112.8900 126.6191 125.1883 97.8783 97.8783 75.1062 75.1062 65.9086 86.7922 103.3359 103.3359 113.2329 114.2906 114.0461 115.9833 12.8944 11.2470 11.2470 11.1473 12.6702 12.6702 11.0375 11.0437 11.0437 11.0530 11.0530 11.0306 11.0159 11.0233 11.1168 11.0336 11.1772 11.1772 11.1025 11.0469 11.0469 11.0852 11.0729 11.0872 11.0332 11.0332 11.0187 11.0187 11.0390 11.0251
irintensity: 0.0405 0.0405 0.0000 0.0000 0.0000 0.0199 0.0199 0.0000 0.1192 0.1192 0.0000 0.0192 0.5758 0.5758 0.4694 0.4694 0.0633 0.1327 0.0059 0.0059 0.0010 0.0000 0.0014 0.0000 21.7235 1.3532 1.3532 0.0000 10.3526 10.3526 0.0000 0.3527 0.3527 1.1232 1.1232 0.0000 0.0000 0.0000 0.0793 0.0000 0.7730 0.7730 6.7840 104.5404 104.5404 0.0000 0.0000 0.4439 63.3302 63.3302 15.7020 15.7020 13.0336 174.1432
temp: 298.150 k
press: 1.00000 atm
elementType: 5 5 5 5 5 5 5 5 5 5 53 53 53 53 53 53 53 53 53 36
symmnumber: 4
zpe: 132834.8 jmol-1
zpe.correction: 0.050594 hartree
zpe.thermalcorrener: 0.076784 hartree
zpe.thermalcorrenthalpy: 0.077728 hartree
zpe.thermalcorrgfe: -0.015075 hartree
zpe.sumelectzpe: -5683.227387 hartree
zpe.sumelectthermal: -5683.201197 hartree
zpe.sumelectthermalent: -5683.200253 hartree
zpe.sumelectthermalfe: -5683.293057 hartree
dipole: 0.0000 -0.0000 -6.9422
dipole: 6.9422
quadrupole: -353.4808 -353.4808 -330.9782
quadrupole: 0.0000 -0.0000 -0.0000
quadrupole: -7.5008 -7.5008 15.0017 0.0000 -0.0000 -0.0000
hfenergy: -5683.2779816 hartree
pointgroup: C04V [C4(Kr1B1B1I1),2SGV(B2I2),2SGD(B2I2)]
dipole: 0. 0. -2.7312873 debye
dipolederiv: -0.0711871 0. 0. 0. -0.0711871 0. 0. 0. 0.8109531 0.2117338 0.3169944 -0.2479851 0.3169944 0.2117339 -0.2479851 -0.2692234 -0.2692233 0.0420604 0.2117338 0.3169944 0.2479851 0.3169944 0.2117338 0.2479851 0.2692234 0.2692234 0.0420604 0.2117338 -0.3169944 0.2479851 -0.3169944 0.2117338 -0.2479851 0.2692234 -0.2692234 0.0420604 0.2117338 -0.3169944 -0.2479851 -0.3169944 0.2117338 0.2479851 -0.2692234 0.2692234 0.0420604 -0.1848376 0. 0. 0. 0.6301749 0.3387296 0. 0.4025259 -0.0618779 0.6301749 0. -0.3387296 0. -0.1848376 0. -0.4025259 0. -0.0618779 0.6301749 0. 0.3387296 0. -0.1848376 0. 0.4025259 0. -0.0618779 -0.1848376 0. 0. 0. 0.6301749 -0.3387296 0. -0.4025259 -0.0618779 -0.2320201 0. 0. 0. -0.2320201 0. 0. 0. 0.841511 -0.3100945 -0.2418383 0.1492505 -0.2418383 -0.3100945 0.1492505 0.1531147 0.1531147 -0.2148821 -0.5831641 0. -0.2014841 0. -0.0932648 0. -0.2140702 0. -0.1643567 -0.0932648 0. 0. 0. -0.5831641 -0.2014841 0. -0.2140702 -0.1643567 -0.0766202 0. 0. 0. -0.0766202 0. 0. 0. -0.6438691 -0.0932648 0. 0. 0. -0.5831641 0.2014841 0. 0.2140702 -0.1643567 -0.5831641 0. 0.2014841 0. -0.0932648 0. 0.2140702 0. -0.1643567 -0.3100945 -0.2418383 -0.1492506 -0.2418383 -0.3100945 -0.1492506 -0.1531147 -0.1531147 -0.2148821 -0.3100945 0.2418383 -0.1492506 0.2418383 -0.3100945 0.1492506 -0.1531147 0.1531147 -0.2148821 -0.3100945 0.2418383 0.1492506 0.2418383 -0.3100945 -0.1492506 0.1531147 -0.1531147 -0.2148821 0.2354532 0. 0. 0. 0.2354532 0. 0. 0. -0.4123701 unknown
polarizability: 452.3629471|0.|452.3629471|0.|0.|454.9091083 unknown
InChI: InChI=1S/B10I9Kr/c11-1-3(12)4(1,13)6(1,15)5(1,3,14)8(3,17)2(20)7(3,4,8,16)9(2,4,6,18)10(2,5,6,8)19
charge -1 multiplicity 1
20 atoms
B  0.0000 0.0000 -2.0007927
B  0.93636671 0.93636671 -1.03166947
B  -0.93636671 -0.93636671 -1.03166947
B  -0.93636671 0.93636671 -1.03166947
B  0.93636671 -0.93636671 -1.03166947
B  0.0000 1.31074302 0.47205357
B  -1.31074302 0.0000 0.47205357
B  1.31074302 0.0000 0.47205357
B  0.0000 -1.31074302 0.47205357
B  0.0000 0.0000 1.53357695
I  2.31773109 2.31773109 -1.96586663
I  3.32166958 0.0000 1.27171177
I  0.0000 3.32166958 1.27171177
I  0.0000 0.0000 3.67674216
I  0.0000 -3.32166958 1.27171177
I  -3.32166958 0.0000 1.27171177
I  -2.31773109 -2.31773109 -1.96586663
I  -2.31773109 2.31773109 -1.96586663
I  2.31773109 -2.31773109 -1.96586663
Kr 0.0000 0.0000 -4.10644138
