program: Gaussian 16
title: 2a-[B10Cl9-H2O](1-)
version: AS64L-G16RevC.01
frameworkgroup: CS[SG(B4Cl3O),X(B6Cl6H2)]
method: RB3LYP
basis: def2QZVPP
operation: Freq
keyword: #P
keyword: Geom=AllCheck
keyword: Guess=TCheck
keyword: SCRF=Check
keyword: GenChk
keyword: RB3LYP/def2QZVPP
keyword: Freq
converged: YES YES YES YES
title: Mulliken charges:
elementType: B B B B B B B B B B Cl Cl Cl Cl Cl Cl Cl Cl Cl O H H
charge: -0.048476 0.228907 0.175444 0.169402 0.169402 0.313582 0.156527 0.313582 0.156527 0.086186 -0.314591 -0.308083 -0.311704 -0.311704 -0.270125 -0.355685 -0.355685 -0.270837 -0.308083 -0.434214 0.259813 0.259813
chargesum: -1.00000
title: Mulliken charges with hydrogens summed into heavy atoms:
elementType: B B B B B B B B B B Cl Cl Cl Cl Cl Cl Cl Cl Cl O
charge: -0.048476 0.228907 0.175444 0.169402 0.169402 0.313582 0.156527 0.313582 0.156527 0.086186 -0.314591 -0.308083 -0.311704 -0.311704 -0.270125 -0.355685 -0.355685 -0.270837 -0.308083 0.085412
polarizability: 2.42166725e+02 1.18605007e+00 2.65215469e+02 -2.75885640e-08 -2.69120808e-08 2.49613424e+02
1716.lowfreq: -0.7266 -0.0023 -0.0002 0.0010 0.6224 1.4163 92.9591 94.2502 97.8937
frequency: 92.9591 94.2502 97.8937 100.8426 101.5735 105.0217 107.1376 112.3114 112.7316 116.7962 126.0016 127.7888 138.3328 138.7593 163.2389 177.1540 217.8337 282.5681 291.0371 302.4730 309.3025 311.9968 324.7004 376.9349 389.4498 433.4307 448.5968 456.9671 461.2340 522.8331 525.8125 545.4541 554.5865 557.8513 580.2423 581.5205 613.1677 626.7397 694.6281 699.6575 722.2209 730.7536 763.3035 836.9816 852.1128 930.3808 945.8388 950.4921 993.7166 1002.3994 1006.4303 1020.8301 1024.8804 1044.3897 1112.1426 1166.8577 1192.2181 1644.8728 3353.8555 3355.5507
redmass: 34.0086 30.8072 31.1059 28.6612 32.2809 31.3363 32.7977 28.9526 33.2730 33.8095 32.8817 33.9650 24.0134 23.6920 24.3646 5.8662 6.0771 22.5191 20.8298 27.8134 29.0161 27.4276 29.4946 1.0545 9.8198 10.8108 8.8990 10.3613 10.4604 11.7768 13.6394 11.6137 9.8571 10.3116 9.2995 10.7754 10.9553 9.1949 8.4290 10.3839 11.0797 10.4754 11.3940 10.8676 6.9029 11.3619 10.9127 11.2058 1.7509 5.1194 11.0525 11.1188 5.6797 6.0917 1.4062 10.9373 9.1128 1.0670 1.0447 1.0839
irintensity: 0.0016 0.1153 0.1857 0.2030 0.0135 0.0712 0.0256 0.4333 0.1542 0.0894 0.0009 0.0616 0.3692 0.6858 0.5201 6.3383 26.9796 0.0463 2.4774 0.1010 0.2879 0.0207 0.1353 16.3383 14.8115 0.4034 0.4818 4.9868 0.0622 53.7847 62.5360 6.8839 17.5040 0.4167 0.1476 2.0939 34.8739 1.6688 0.3865 0.5392 0.6665 10.5342 9.2001 45.1116 13.3821 4.7929 4.2155 15.2938 428.5657 135.2213 123.3904 141.7854 28.1212 113.0351 0.0346 128.6046 107.4619 44.9446 167.5847 311.8303
temp: 298.150 k
press: 1.00000 atm
elementType: 5 5 5 5 5 5 5 5 5 5 17 17 17 17 17 17 17 17 17 8 1 1
symmnumber: 1
zpe: 225328.8 jmol-1
zpe.correction: 0.085823 hartree
zpe.thermalcorrener: 0.107257 hartree
zpe.thermalcorrenthalpy: 0.108201 hartree
zpe.thermalcorrgfe: 0.035700 hartree
zpe.sumelectzpe: -4467.885216 hartree
zpe.sumelectthermal: -4467.863782 hartree
zpe.sumelectthermalent: -4467.862838 hartree
zpe.sumelectthermalfe: -4467.935339 hartree
dipole: 6.4115 -0.9196 0.0000
dipole: 6.4771
quadrupole: -185.6758 -217.5463 -207.5827
quadrupole: -3.3580 -0.0000 -0.0000
quadrupole: 17.9258 -13.9448 -3.9811 -3.3580 -0.0000 -0.0000
hfenergy: -4467.9710389 hartree
pointgroup: CS [SG(B4Cl3O1),X(B6Cl6H2)]
dipole: 2.5224646 -0.3618101 0. debye
dipolederiv: -0.0669348 0.2757782 0. 0.365352 1.0103972 0. 0. 0. -0.1559142 0.6451887 -0.1114665 0. -0.0057663 -0.0131045 0. 0. 0. -0.0122167 0.634294 -0.558055 0. -0.5360281 0.3017779 0. 0. 0. -0.0346526 -0.0052278 0.0739506 0.0776755 0.0344757 0.0452012 0.3756998 0.1312574 0.3986399 0.8441206 -0.0052278 0.0739506 -0.0776755 0.0344757 0.0452012 -0.3756999 -0.1312574 -0.3986399 0.8441206 0.3423665 -0.3116558 0.3551696 -0.3472287 0.0948101 -0.2713043 0.4215168 -0.2360291 0.2870066 0.5562234 0.160443 -0.5143648 0.1483343 -0.0439879 -0.1704359 -0.5274624 -0.1883325 0.4079079 0.3423665 -0.3116558 -0.3551696 -0.3472287 0.0948101 0.2713043 -0.4215168 0.2360291 0.2870066 0.5562233 0.160443 0.5143648 0.1483343 -0.0439878 0.1704359 0.5274624 0.1883325 0.4079079 -0.1159759 0.3250385 0. 0.3217354 1.0153251 0. 0. 0. -0.1531429 -0.6414896 0.3844789 0. 0.3777267 -0.4255279 0. 0. 0. -0.1595391 -0.1844988 -0.0297388 -0.0910259 -0.0288093 -0.2460097 -0.2608161 -0.1034173 -0.2755735 -0.8465572 -0.567297 -0.1148633 0.3756 -0.1099593 -0.175719 0.1124125 0.3788527 0.1141604 -0.5013326 -0.567297 -0.1148633 -0.3756 -0.1099593 -0.175719 -0.1124125 -0.3788527 -0.1141604 -0.5013326 -0.1858054 -0.1795561 0. -0.1628263 -0.9514397 0. 0. 0. -0.1618543 -0.5680636 0.184721 0.2547021 0.164235 -0.3363154 -0.2502619 0.2438325 -0.2433505 -0.4311478 -0.5680636 0.184721 -0.2547021 0.164235 -0.3363154 0.2502619 -0.2438325 0.2433505 -0.4311478 -0.23654 -0.2229487 0. -0.2403903 -0.9344177 0. 0. 0. -0.1535752 -0.1844988 -0.0297388 0.0910259 -0.0288093 -0.2460097 0.2608161 0.1034173 0.2755735 -0.8465572 -0.8924334 0.0450119 0. -0.1151676 -0.3433523 0. 0. 0. -0.4721166 0.3563455 0.0580027 0.0194923 0.1366345 0.3321915 -0.1402513 -0.0244853 -0.1626697 0.3915083 0.3563455 0.0580027 -0.0194923 0.1366345 0.3321915 0.1402512 0.0244853 0.1626697 0.3915083 unknown
polarizability: 242.1667331|1.186125|265.2154616|0.|0.|249.6134236 unknown
InChI: InChI=1S/B10Cl9H2O/c11-1-3(13)4(1,14)5(3,15)2(12)8(3,5,18)6(1,3,16)7(1,4,17)9(2,4,5,19)10(2,6,7,8)20/h20H2
charge -1 multiplicity 1
22 atoms
B  0.52561257 1.81372641 0.0000
B  1.44041135 0.43860108 0.0000
B  -1.00270359 1.08950193 0.0000
B  0.24208324 0.77163371 1.30994455
B  0.24208324 0.77163371 -1.30994455
B  0.7559249 -0.9318235 0.90857101
B  -1.01483303 -0.50416677 0.92404076
B  0.7559249 -0.9318235 -0.90857101
B  -1.01483303 -0.50416677 -0.92404076
B  -0.36859099 -1.77354959 0.0000
Cl -2.46786502 2.11646721 0.0000
Cl 0.4469787 1.36070923 2.99228452
Cl -2.3164256 -0.83096675 2.10750074
Cl -2.3164256 -0.83096675 -2.10750074
Cl -0.76715997 -3.50918709 0.0000
Cl 2.0125259 -1.70944536 -1.98118291
Cl 2.0125259 -1.70944536 1.98118291
Cl 1.00914518 3.52829561 0.0000
Cl 0.4469787 1.36070923 -2.99228452
O  2.97394459 0.37330643 0.0000
H  3.18917133 -0.18963156 0.78473936
H  3.18917133 -0.18963156 -0.78473936
