program: Gaussian 16
title: B10Cl9 meta N2
version: AS64L-G16RevC.01
frameworkgroup: C1[X(B10Cl9N2)]
method: RB3LYP
basis: def2QZVPP
operation: Freq
keyword: #N
keyword: Geom=AllCheck
keyword: Guess=TCheck
keyword: SCRF=Check
keyword: GenChk
keyword: RB3LYP/def2QZVPP
keyword: Freq
converged: YES YES YES YES
title: Mulliken charges:
elementType: B B B B B B B B B B Cl Cl Cl Cl Cl Cl Cl Cl Cl N N
charge: 0.171173 0.151815 0.253527 0.253528 0.151815 0.261803 -0.266225 0.175336 0.261803 0.067055 -0.245736 -0.289233 -0.289221 -0.289233 -0.306483 -0.258814 -0.298107 -0.298107 -0.306483 0.022016 0.077770
chargesum: -1.00000
title: Mulliken charges with hydrogens summed into heavy atoms:
1716.lowfreq: -0.8438 -0.0025 -0.0021 0.0020 1.7716 3.8657 70.2156 76.0111 92.5512
frequency: 70.2156 76.0111 92.5512 93.7475 98.6982 100.6353 103.3759 103.9157 107.8750 111.7056 114.8641 117.7783 125.0879 129.0295 139.6876 140.1647 155.5880 276.8516 279.5599 299.5448 308.7540 315.4142 324.2317 335.1539 338.4600 372.2087 433.4987 448.0057 476.0430 488.3868 514.7127 529.1322 538.8545 562.0392 569.9881 571.2960 579.6756 618.0593 630.7394 677.4353 685.9053 726.6392 747.1486 750.7242 821.3405 851.6301 945.3620 946.5840 961.0646 1001.1186 1005.8070 1006.6374 1022.1042 1056.2176 1137.2351 1158.0506 2321.9967
redmass: 15.6061 15.7438 33.8487 33.8463 34.6575 33.8683 33.7096 34.2744 34.2547 34.1895 33.2852 31.5847 34.7712 34.8225 27.1036 25.8239 24.5893 22.7102 25.9079 27.6176 30.0707 29.6450 26.9610 13.5055 18.7380 13.6324 11.6684 11.2989 11.9256 12.6252 11.6468 13.1427 12.5934 13.2798 12.1753 11.2194 11.2179 11.7076 11.1873 11.2192 11.3775 11.6273 11.5987 11.7002 11.1305 11.1400 11.5159 11.4809 11.4586 11.3307 11.3690 11.3164 11.2487 11.2083 11.2837 11.2465 13.9997
irintensity: 0.3441 0.8425 0.0067 0.0009 0.0027 0.0140 0.0650 0.0000 0.0002 0.0400 0.1354 0.1839 0.0052 0.0011 0.2316 0.4318 0.2758 0.4886 0.0034 0.0963 0.0316 0.0677 2.2036 1.1886 10.5246 0.8969 0.0185 0.1619 4.3021 8.2280 6.7584 31.4647 33.2315 28.9672 20.7085 0.2708 0.3078 17.4961 5.7554 7.9428 1.8137 0.0216 9.1848 8.4192 42.9151 22.4023 6.4927 0.1015 91.5545 0.9697 138.4768 164.9988 144.9681 104.4934 106.4894 281.6397 547.9090
temp: 298.150 k
press: 1.00000 atm
elementType: 5 5 5 5 5 5 5 5 5 5 17 17 17 17 17 17 17 17 17 7 7
symmnumber: 1
zpe: 176536.2 jmol-1
zpe.correction: 0.067239 hartree
zpe.thermalcorrener: 0.089490 hartree
zpe.thermalcorrenthalpy: 0.090434 hartree
zpe.thermalcorrgfe: 0.015405 hartree
zpe.sumelectzpe: -4500.984434 hartree
zpe.sumelectthermal: -4500.962184 hartree
zpe.sumelectthermalent: -4500.961239 hartree
zpe.sumelectthermalfe: -4501.036268 hartree
dipole: -2.2305 -0.0001 3.9443
dipole: 4.5313
quadrupole: -216.0906 -211.5533 -198.8171
quadrupole: 0.0001 -5.3840 -0.0003
quadrupole: -7.2703 -2.7330 10.0032 0.0001 -5.3840 -0.0003
hfenergy: -4501.0516735 hartree
pointgroup: C01 [X(B10Cl9N2)]
dipole: 1.0760792 -1.0958596 -0.9051654 debye
dipolederiv: -0.1847885 0.0044309 -0.016196 0.0042985 -0.1846164 0.0224978 -0.0465147 0.0532652 1.2100855 -0.1031731 0.0537298 0.026809 -0.0114479 0.866182 0.4544104 0.016855 0.4556311 -0.0084704 0.0569672 -0.1103203 0.0296013 0.0575563 0.8671349 -0.4439312 -0.0389347 -0.3020146 0.1285945 0.8694293 0.0477909 0.4400194 -0.1209989 0.0579062 -0.0352555 0.2998429 0.0346132 0.1253587 0.8626058 -0.0276186 -0.4584383 0.0375129 -0.1037154 -0.0199223 -0.4597922 -0.0096661 -0.0043529 0.3399154 0.4767738 -0.3475871 0.3990546 0.5133358 -0.2275044 -0.272067 -0.2875683 -0.0096428 -0.4662879 0.4090002 0.173196 0.4087225 -0.4794694 -0.1762681 0.1104537 -0.1126042 -0.1845188 0.533076 -0.5463727 0.2389477 -0.5464214 0.5470089 -0.2415343 0.2269887 -0.2294024 0.2062873 0.5283553 0.3984917 0.2284977 0.4767957 0.3297822 0.3406923 0.2871154 0.2646431 -0.0145275 -0.110883 -0.0364571 0.0421869 -0.0357492 -0.110881 -0.0374556 0.2044305 -0.2020884 1.0799837 -0.1353372 -0.0023913 0.0303609 -0.0027256 -0.1352085 -0.0343651 -0.0462863 0.0434092 -0.9534891 -0.4918654 -0.3706115 0.2127501 -0.3094219 -0.4903995 0.1912538 0.1982877 0.2070576 -0.2413573 -0.5285266 0.3906607 -0.1904844 0.3905726 -0.538188 0.192807 -0.2107229 0.2133432 -0.2527044 -0.5020817 -0.3109747 -0.1918666 -0.3722941 -0.4836666 -0.2072697 -0.207194 -0.1928451 -0.2378755 -0.8389985 0.0179464 0.2928052 -0.0052701 -0.1493853 0.0000271 0.2923505 -0.0149524 -0.2474576 -0.1473577 0.0001158 -0.0076396 0.0002368 -0.1474342 0.0038678 0.0201109 -0.0242911 -1.0377789 -0.1447435 0.0226276 -0.009096 -0.0355663 -0.8194815 0.30593 0.0087681 0.23555 -0.2440496 -0.8218764 -0.0270436 -0.3031315 0.0315325 -0.1446647 0.0130008 -0.2332704 -0.0056343 -0.2417327 -0.1493212 -0.0166315 -0.0046567 0.0066483 -0.8415411 -0.2902522 0.0102282 -0.2899147 -0.2449791 -0.6226961 0.6575342 0.3653625 0.6577512 -0.6453097 -0.3715545 0.415356 -0.4222841 -0.1639708 1.0575879 -1.0306808 -0.5514403 -1.0307865 1.0926115 0.5608259 -0.5760054 0.585753 0.3365977 unknown
polarizability: 266.1130263|-14.3239172|266.5938405|-7.1209376|7.3274889|275.3724603 unknown
InChI: InChI=1S/B10Cl9N2/c11-1-3(13)4(1,14)5(3,15)2(12)8(3,5,18)6(1,3,16)7(1,4,17)9(2,4,5,19)10(2,6,7,8)21-20
charge -1 multiplicity 1
21 atoms
B  0.01630217 -0.02350707 1.83131379
B  0.02027371 1.28765544 0.75967215
B  -0.02392955 -1.32502218 0.7734633
B  1.31364028 -0.00684422 0.76771374
B  -1.29943994 -0.0129265 0.7653447
B  0.91746106 0.92777339 -0.78094225
B  0.85851301 -0.8892962 -0.73424209
B  -0.92356798 0.91883242 -0.77258396
B  -0.95941106 -0.92188828 -0.77287444
B  -0.01750414 -0.00529328 -1.85764235
Cl 0.03664593 -0.06797157 -3.63035465
Cl 2.14555125 2.0498867 -1.43199086
Cl -2.09135093 2.10099022 -1.4157115
Cl -2.10215544 -2.13623747 -1.41373286
Cl -2.97516983 0.00228737 1.38995793
Cl 0.03511594 -0.03485404 3.60672798
Cl 0.03023819 -3.02805359 1.3294381
Cl 3.01810826 -0.08350056 1.31659517
Cl 0.0322405 2.96609788 1.37703118
N  2.51613993 -2.57554254 -1.70640725
N  1.80727708 -1.85436668 -1.27352449
