program: Gaussian 16
title: B6I5_H2O c2v
version: ES64L-G16RevC.01
frameworkgroup: C1[X(B6H2I5O)]
method: RB3LYP
basis: def2QZVPP
operation: Freq
keyword: #N
keyword: Geom=AllCheck
keyword: Guess=TCheck
keyword: SCRF=Check
keyword: GenChk
keyword: RB3LYP/def2QZVPP
keyword: Freq
converged: YES YES YES YES
title: Mulliken charges:
elementType: B B B B B B I I I I I O H H
charge: -0.411346 0.202432 0.243734 0.073242 0.202431 0.243733 -0.378015 -0.378015 -0.312661 -0.312661 -0.313203 -0.383571 0.261950 0.261949
chargesum: -1.00000
title: Mulliken charges with hydrogens summed into heavy atoms:
elementType: B B B B B B I I I I I O
charge: -0.411346 0.202432 0.243734 0.073242 0.202431 0.243733 -0.378015 -0.378015 -0.312661 -0.312661 -0.313203 0.140327
1716.lowfreq: -1.6077 -0.6598 -0.0001 -0.0001 0.0002 0.7574 26.1721 32.6156 34.2542
frequency: 26.1703 32.6154 34.2540 36.7294 51.6422 51.7049 61.4853 97.8216 114.2916 150.3677 152.7752 253.0583 296.3776 358.2145 364.5135 365.9549 397.9337 405.3419 474.2546 481.4245 530.9422 565.8391 735.2841 773.6315 779.5152 892.3337 925.1604 939.5745 988.3530 1072.7560 1133.5591 1133.8829 1229.3003 1634.6389 3489.4343 3524.6735
redmass: 53.2827 98.0965 101.0698 117.2844 52.2787 60.3468 26.7299 6.1105 6.0328 68.1823 74.6722 12.4427 1.0476 11.6720 10.1432 10.3463 6.6580 8.3239 7.8668 7.3635 10.3496 10.1411 10.5268 7.3990 6.8530 1.7144 7.5463 4.3440 1.6402 10.0998 9.9867 4.3358 9.9154 1.0740 1.0441 1.0848
irintensity: 0.5313 0.3834 0.4183 0.0039 0.0242 0.1087 1.4344 8.8220 21.6942 0.4984 0.2342 1.4921 16.1976 1.7374 1.5968 8.1967 0.1646 10.8232 0.1290 12.9416 3.0386 18.7533 10.7275 61.1974 1.1616 127.9327 4.7834 203.6655 62.4547 209.7319 42.3394 84.5213 11.8712 41.6732 162.6624 294.8317
temp: 298.150 k
press: 1.00000 atm
elementType: 5 5 5 5 5 5 53 53 53 53 53 8 1 1
symmnumber: 1
zpe: 146876.4 jmol-1
zpe.correction: 0.055942 hartree
zpe.thermalcorrener: 0.071442 hartree
zpe.thermalcorrenthalpy: 0.072386 hartree
zpe.thermalcorrgfe: 0.004209 hartree
zpe.sumelectzpe: -1714.941305 hartree
zpe.sumelectthermal: -1714.925805 hartree
zpe.sumelectthermalent: -1714.924861 hartree
zpe.sumelectthermalfe: -1714.993039 hartree
dipole: -3.9126 -0.0000 -3.9879
dipole: 5.5868
quadrupole: -203.7169 -207.9063 -185.6347
quadrupole: 0.0000 10.2815 0.0000
quadrupole: -4.6309 -8.8203 13.4513 0.0000 10.2815 0.0000
hfenergy: -1714.9972476 hartree
pointgroup: C01 [X(B6H2I5O1)]
dipole: -0.0035009 -0.8580762 -2.0236081 debye
dipolederiv: -0.2345688 0.0006075 0.0014665 0.0001581 -0.1880377 0.0963778 0.0011728 0.2850863 0.4432778 0.3134542 -0.6094368 -0.0369967 -0.5906674 0.3543761 -0.0882565 -0.1391071 0.028408 -0.2471926 0.1953344 -0.4954545 -0.353054 -0.489453 0.1968148 0.2540342 -0.1651715 0.0527719 -0.164277 -0.2400217 0.0000345 0.0035966 -0.0001919 -0.274476 -0.1027959 0.0034519 -0.0076607 1.202881 0.3105849 0.6094216 0.034602 0.5901001 0.3580657 -0.0909631 0.1363548 0.0259241 -0.2480183 0.1947586 0.4957003 0.3505569 0.4906545 0.199855 0.2527831 0.1632941 0.0509141 -0.166741 -0.4172262 -0.2921255 -0.0448999 -0.2922816 -0.4315657 -0.0361233 -0.064853 -0.0706633 -0.3213194 -0.4185002 0.291823 0.0454716 0.2921457 -0.4297655 -0.0373758 0.0655321 -0.071854 -0.3218476 -0.4570089 0.2963595 0.0182909 0.2894884 -0.4524174 -0.0145339 0.0269465 -0.021029 -0.1784135 -0.4554155 -0.2964632 -0.0169223 -0.2895631 -0.4542211 -0.0132069 -0.0255582 -0.0196958 -0.1782066 -0.1726229 -0.0000387 -0.0012278 0.0000466 -0.1692658 0.0217008 -0.0011732 -0.0140521 -0.673725 -0.3832608 -0.0005888 -0.001326 0.0000705 -0.2842773 0.0928347 -0.0008987 -0.1842528 -0.8796674 0.3816693 0.1421086 -0.0834793 0.1329666 0.2878806 -0.1676835 0.0196657 -0.0272558 0.3667776 0.3828237 -0.1419474 0.0839217 -0.1334734 0.2870341 -0.1667917 -0.0196561 -0.0266409 0.3664718 unknown
polarizability: 287.9631292|0.0430813|287.0396979|-0.1124008|17.4752834|252.1365031 unknown
InChI: InChI=1S/B6H2I5O/c7-1-2(8)3(1,9)5(1,11)4(1,2,10)6(2,3,5)12/h12H2
charge -1 multiplicity 1
14 atoms
B  -0.00207881 0.21674481 -1.56649916
B  -0.86329705 0.98890992 -0.37095045
B  0.8495141 -0.71381993 -0.46692915
B  0.0038233 0.03056641 0.78938976
B  0.86244703 0.99156723 -0.37506367
B  -0.84555005 -0.71643025 -0.46288912
I  -2.28505829 -2.20146877 -1.12747455
I  2.29040551 -2.1944208 -1.1383842
I  -2.40086724 2.4944932 -0.21506977
I  2.3961008 2.50187858 -0.22650721
I  0.00894822 0.04010684 2.94578734
O  -0.00517347 -0.09613488 -3.06884393
H  -0.78751698 -0.6722031 -3.20134247
H  0.77830293 -0.66978925 -3.20506943
