program: Gaussian 16
title: B6I5_Ar (1-)
version: AS64L-G16RevC.01
frameworkgroup: C4V[C4(ArBBI),2SGV(B2I2)]
method: RB3LYP
basis: def2QZVPP
operation: Freq
keyword: #N
keyword: Geom=AllCheck
keyword: Guess=TCheck
keyword: SCRF=Check
keyword: GenChk
keyword: RB3LYP/def2QZVPP
keyword: Freq
converged: YES YES YES YES
title: Mulliken charges:
elementType: B B B B B B I I I I I Ar
charge: 0.127767 -0.402982 0.119563 0.127767 0.127767 0.127767 -0.270752 -0.270752 -0.279683 -0.270752 -0.270752 0.135041
chargesum: -1.00000
title: Mulliken charges with hydrogens summed into heavy atoms:
1716.lowfreq: -0.0009 -0.0008 -0.0006 3.1723 3.1723 3.1912 28.8947 28.8947 30.6000
frequency: 28.8947 28.8947 30.6000 38.1724 44.6500 44.6500 56.7626 57.7518 57.7518 134.0418 153.0517 155.6172 298.5355 354.0407 354.0407 359.2092 370.1779 370.1779 449.3194 449.3194 505.1019 668.2806 759.2587 759.2587 786.1915 984.3817 1053.5420 1115.3037 1115.3037 1169.0502
redmass: 91.1079 91.1079 126.8162 126.1283 67.6030 67.6030 48.0522 52.8745 52.8745 48.8406 102.6191 120.4672 13.6234 11.1851 11.1851 11.1253 12.7887 12.7887 11.1275 11.1275 11.0165 11.0099 11.0178 11.0178 11.0898 11.0591 11.0326 11.0357 11.0357 11.0447
irintensity: 0.0761 0.0761 0.0000 0.0000 0.1903 0.1903 0.3752 1.1756 1.1756 7.5601 0.3285 0.0000 18.0118 0.4909 0.4909 0.0000 2.1612 2.1612 4.7826 4.7826 0.0000 0.0000 15.2308 15.2308 18.0148 0.0000 141.6331 143.6072 143.6072 3.8924
temp: 298.150 k
press: 1.00000 atm
elementType: 5 5 5 5 5 5 53 53 53 53 53 18
symmnumber: 4
zpe: 76269.9 jmol-1
zpe.correction: 0.029050 hartree
zpe.thermalcorrener: 0.044912 hartree
zpe.thermalcorrenthalpy: 0.045856 hartree
zpe.thermalcorrgfe: -0.023212 hartree
zpe.sumelectzpe: -2165.997390 hartree
zpe.sumelectthermal: -2165.981528 hartree
zpe.sumelectthermalent: -2165.980583 hartree
zpe.sumelectthermalfe: -2166.049652 hartree
dipole: -0.0000 0.0000 -4.7428
dipole: 4.7428
quadrupole: -213.6730 -213.6730 -183.6189
quadrupole: 0.0000 -0.0000 -0.0000
quadrupole: -10.0180 -10.0180 20.0361 0.0000 -0.0000 -0.0000
hfenergy: -2166.02644 hartree
pointgroup: C04V [C4(Ar1B1B1I1),2SGV(B2I2)]
dipole: 0. 0. -1.8659645 debye
dipolederiv: -0.2904441 0. 0. 0. 0.8623962 -0.0177045 0. -0.0359631 -0.2366051 -0.171428 0. 0. 0. -0.171428 0. 0. 0. 1.1024734 -0.3533199 0. 0. 0. -0.3533199 0. 0. 0. 0.7461297 -0.2904441 0. 0. 0. 0.8623962 0.0177045 0. 0.0359631 -0.2366051 0.8623962 0. 0.0177045 0. -0.2904441 0. 0.0359631 0. -0.2366051 0.8623962 0. -0.0177045 0. -0.2904441 0. -0.0359631 0. -0.2366051 -0.1390148 0. 0. 0. -0.6932637 0.0372577 0. 0.0323254 -0.1663898 -0.6932637 0. 0.0372577 0. -0.1390148 0. 0.0323254 0. -0.1663898 -0.1399566 0. 0. 0. -0.1399566 0. 0. 0. -0.5684565 -0.6932637 0. -0.0372577 0. -0.1390148 0. -0.0323254 0. -0.1663898 -0.1390148 0. 0. 0. -0.6932637 -0.0372577 0. -0.0323254 -0.1663898 0.1853573 0. 0. 0. 0.1853573 0. 0. 0. -0.668167 unknown
polarizability: 288.3732684|0.|288.3732684|0.|0.|255.6296465 unknown
InChI: InChI=1S/ArB6I5/c1-2-3(8)4(2,9)6(2,11)5(2,3,10)7(3,4,6)12
charge -1 multiplicity 1
12 atoms
B  0.0000 1.23360965 -0.34417715
B  0.0000 0.0000 -1.43961955
B  0.0000 0.0000 0.82629352
B  0.0000 -1.23360965 -0.34417715
B  -1.23360965 0.0000 -0.34417715
B  1.23360965 0.0000 -0.34417715
I  0.0000 3.38172677 -0.39164002
I  3.38172677 0.0000 -0.39164002
I  0.0000 0.0000 2.9802839
I  -3.38172677 0.0000 -0.39164002
I  0.0000 -3.38172677 -0.39164002
Ar 0.0000 0.0000 -3.53451372
