program: Gaussian 16
title: B6Cl5_Ar (1-)
version: ES64L-G16RevC.01
frameworkgroup: C4V[C4(ClBBAr),2SGV(B2Cl2)]
method: RB3LYP
basis: def2QZVPP
operation: Freq
keyword: #N
keyword: Geom=AllCheck
keyword: Guess=TCheck
keyword: SCRF=Check
keyword: GenChk
keyword: RB3LYP/def2QZVPP
keyword: Freq
converged: YES YES YES YES
title: Mulliken charges:
elementType: B B B B B B Ar Cl Cl Cl Cl Cl
charge: 0.038800 0.117278 0.267391 0.038800 0.038800 0.038800 0.127236 -0.330657 -0.330657 -0.344474 -0.330657 -0.330657
chargesum: -1.00000
title: Mulliken charges with hydrogens summed into heavy atoms:
1716.lowfreq: -0.0059 -0.0057 -0.0031 2.6591 2.6591 2.9973 42.9743 42.9743 67.8496
frequency: 42.9742 42.9742 67.8496 84.3085 84.3085 92.9814 97.6891 114.4303 114.4303 176.5827 325.2803 333.5706 420.0575 420.0575 434.9697 435.7027 455.5689 455.5689 522.3632 531.8638 531.8638 637.7682 726.0793 726.0793 839.3432 1062.8767 1100.0413 1163.3245 1163.3245 1222.1219
redmass: 35.4963 35.4963 34.9256 34.2048 34.2048 34.5038 35.4711 25.4367 25.4367 21.9889 31.4430 32.2641 11.4478 11.4478 16.9048 11.3994 11.2577 11.2577 11.0716 14.7086 14.7086 11.0136 11.1060 11.1060 11.3426 11.2917 11.1648 11.1704 11.1704 11.2285
irintensity: 0.9457 0.9457 0.0000 0.5666 0.5666 0.0000 1.0760 0.0384 0.0384 9.7249 1.9864 0.0000 0.2976 0.2976 46.2368 0.0000 0.0397 0.0397 0.0000 42.9225 42.9225 0.0000 14.4617 14.4617 17.2113 0.0000 126.4946 213.1352 213.1352 7.7036
temp: 298.150 k
press: 1.00000 atm
elementType: 5 5 5 5 5 5 18 17 17 17 17 17
symmnumber: 4
zpe: 86288.8 jmol-1
zpe.correction: 0.032866 hartree
zpe.thermalcorrener: 0.046780 hartree
zpe.thermalcorrenthalpy: 0.047724 hartree
zpe.thermalcorrgfe: -0.010152 hartree
zpe.sumelectzpe: -2978.203296 hartree
zpe.sumelectthermal: -2978.189381 hartree
zpe.sumelectthermalent: -2978.188437 hartree
zpe.sumelectthermalfe: -2978.246313 hartree
dipole: 0.0000 0.0000 6.7733
dipole: 6.7733
quadrupole: -135.6716 -135.6716 -112.4235
quadrupole: 0.0000 0.0000 0.0000
quadrupole: -7.7494 -7.7494 15.4987 0.0000 0.0000 0.0000
hfenergy: -2978.2361613 hartree
pointgroup: C04V [C4(Cl1B1B1Ar1),2SGV(B2Cl2)]
dipole: 0. 0. -2.6648096 debye
dipolederiv: -0.184176 0. 0. 0. 1.0692843 0.1134934 0. -0.0068679 -0.1355185 -0.1244164 0. 0. 0. -0.1244164 0. 0. 0. 1.0037757 -0.1828277 0. 0. 0. -0.1828277 0. 0. 0. 0.9104409 -0.184176 0. 0. 0. 1.0692843 -0.1134934 0. 0.0068679 -0.1355185 1.0692843 0. -0.1134934 0. -0.184176 0. 0.0068679 0. -0.1355185 1.0692843 0. 0.1134934 0. -0.184176 0. -0.0068679 0. -0.1355185 0.1804858 0. 0. 0. 0.1804858 0. 0. 0. -0.6288192 -0.1849916 0. 0. 0. -1.0434361 -0.0246766 0. -0.0388848 -0.1927321 -1.0434361 0. 0.0246766 0. -0.1849916 0. 0.0388848 0. -0.1927321 -0.1866032 0. 0. 0. -0.1866032 0. 0. 0. -0.972395 -0.1849916 0. 0. 0. -1.0434361 0.0246766 0. 0.0388848 -0.1927321 -1.0434361 0. -0.0246766 0. -0.1849916 0. -0.0388848 0. -0.1927321 unknown
polarizability: 164.0563608|0.|164.0563608|0.|0.|158.3962984 unknown
InChI: InChI=1S/ArB6Cl5/c1-2-3(8)4(2,9)6(2,11)5(2,3,10)7(3,4,6)12
charge -1 multiplicity 1
12 atoms
B  0.0000 1.2389885 -0.34360699
B  0.0000 0.0000 -1.44324813
B  0.0000 0.0000 0.83222009
B  0.0000 -1.2389885 -0.34360699
B  -1.2389885 0.0000 -0.34360699
B  1.2389885 0.0000 -0.34360699
Ar 0.0000 0.0000 -3.54771202
Cl 0.0000 -3.03220086 -0.38017644
Cl 3.03220086 0.0000 -0.38017644
Cl 0.0000 0.0000 2.6316943
Cl 0.0000 3.03220086 -0.38017644
Cl -3.03220086 0.0000 -0.38017644
