program: Orca
programVersion: 5.0.3
elementType: C N C C N C C C P C C C C C C C C C C C C C C N C C H H H H H H H H H H H H H H H H H H H H H H H H H H H H H H H H H H H H H H H H H H H H H
charge: 1
multiplicity: 1
keywords: SP DSD-BLYP D3BJ def2-QZVPP def2-QZVPP/C def2/J TightSCF CPCM(Acetonitrile)
formula: C22H45N3P
InChI: InChI=1S/C12H28P.C10H17N3/c1-4-7-10-13(11-8-5-2)12-9-6-3;1-11(2)10(12(3)4)13-8-6-5-7-9-13/h13H,4-12H2,1-3H3;5-9H,1-4H3
71 atoms
C  3.097375 -0.863288 2.153625
N  4.116999 -0.470983 1.196526
C  5.472992 -0.87099 1.531498
C  3.833628 0.21094 0.085178
N  2.662378 -0.003319 -0.544469
C  2.099358 -1.300157 -0.620978
C  0.872239 -1.497162 -1.100817
C  -0.036539 -0.408842 -1.513705
P  -1.688945 -0.217791 -0.212463
C  -2.356258 1.149274 -1.265358
C  -3.849881 1.392876 -1.103157
C  -4.371923 2.524906 -1.985596
C  -4.263798 2.253386 -3.480377
C  -2.255925 -1.929176 -0.630669
C  -2.100482 -2.864146 0.566052
C  -2.821567 -4.197856 0.392406
C  -2.299499 -5.032825 -0.769166
C  -0.543443 0.100908 1.215498
C  -1.203283 0.678836 2.456419
C  -1.673209 2.115999 2.275408
C  -2.320288 2.686896 3.528155
C  0.730491 0.842782 -1.68037
C  1.963991 1.032687 -1.212727
N  4.700722 1.099807 -0.408634
C  4.918349 1.267452 -1.835007
C  5.53998 1.915786 0.450522
H  2.891239 -1.933229 2.105958
H  3.454966 -0.624513 3.155371
H  2.174753 -0.3154 1.984456
H  5.874611 -0.281107 2.356095
H  5.45912 -1.918552 1.833104
H  6.128114 -0.777532 0.670053
H  2.75498 -2.108722 -0.332661
H  0.544684 -2.525934 -1.190373
H  -0.557057 -0.6721 -2.440248
H  -2.849991 -0.129153 0.704792
H  -1.794192 2.051021 -1.004321
H  -2.10641 0.917207 -2.301419
H  -4.39918 0.472905 -1.328964
H  -4.069354 1.628289 -0.059403
H  -5.419703 2.70412 -1.730695
H  -3.838678 3.448172 -1.738559
H  -4.724261 3.055065 -4.058671
H  -3.227185 2.172793 -3.809954
H  -4.768044 1.322614 -3.747637
H  -3.316756 -1.819747 -0.877657
H  -1.749898 -2.318964 -1.513161
H  -1.038397 -3.052109 0.752369
H  -2.487532 -2.368245 1.462014
H  -2.720437 -4.769068 1.319039
H  -3.892369 -4.01356 0.263481
H  -2.48272 -4.55327 -1.731353
H  -1.223163 -5.195766 -0.68167
H  -2.78017 -6.011086 -0.797936
H  0.25893 0.753248 0.867453
H  -0.080332 -0.864015 1.438696
H  -0.48679 0.636617 3.283079
H  -2.048039 0.050427 2.755551
H  -2.385635 2.169364 1.446759
H  -0.821132 2.735882 1.979739
H  -1.626018 2.680275 4.370451
H  -2.6460 3.716516 3.37724
H  -3.195632 2.103441 3.819497
H  0.270594 1.681506 -2.187625
H  2.47289 1.981075 -1.284912
H  5.983581 1.157117 -2.041738
H  4.38387 0.511681 -2.40371
H  4.603341 2.255945 -2.171639
H  5.510352 2.9430 0.086529
H  5.16799 1.909113 1.471364
H  6.577402 1.578778 0.443222
elementType: C N P H
totalener: -1367.36257553 hartree
nucrepener: 2816.00383505 hartree
electener: -4183.36641058 hartree
oneelecener: -7438.47048236 hartree
twoeener: 3255.10407178 hartree
cpcmener: -0.07397441 hartree
kineticenergy: 1364.17783009 hartree
exchangeener: -53.557371312100 hartree
correlationener: -3.826291616763 hartree
xcener: -57.383662928863 hartree
chargesum: 1.0000000
charge: -0.034992 -0.286372 -0.050455 0.464697 -0.312201 -0.027972 -0.231741 0.000697 0.775746 -0.155242 -0.119761 -0.088617 -0.198742 -0.167002 -0.076117 -0.106654 -0.203543 -0.114478 -0.099409 -0.106591 -0.211148 -0.266385 -0.015543 -0.286102 -0.059290 -0.046899 0.082201 0.093325 0.094563 0.089413 0.102815 0.095395 0.142715 0.117702 0.034946 -0.263818 0.071516 0.081864 0.067605 0.056965 0.038182 0.040853 0.053802 0.060516 0.061024 0.080839 0.064611 0.049328 0.070044 0.041809 0.045738 0.056503 0.061642 0.058484 0.078560 0.051756 0.055644 0.054034 0.059466 0.048053 0.055426 0.055741 0.059009 0.140219 0.145441 0.098228 0.101881 0.090199 0.097615 0.095886 0.086377
charge: 0.187280 0.414152 0.189401 -0.441934 0.426401 -0.025036 0.042225 -0.096058 0.643853 0.049874 0.064445 0.086902 0.225197 0.054025 0.070261 0.087144 0.225450 0.050493 0.066765 0.078744 0.226273 0.039131 -0.023169 0.408994 0.184640 0.186782 -0.051506 -0.045997 -0.048236 -0.051304 -0.045796 -0.044492 -0.051068 -0.050702 -0.063571 -0.070522 -0.051834 -0.054074 -0.045666 -0.054247 -0.052313 -0.050377 -0.065656 -0.066027 -0.061659 -0.053888 -0.062031 -0.046351 -0.045685 -0.052096 -0.050511 -0.064348 -0.061554 -0.065734 -0.056056 -0.055260 -0.046568 -0.052062 -0.050440 -0.050519 -0.062827 -0.066096 -0.062252 -0.051742 -0.054240 -0.046897 -0.044602 -0.052586 -0.046493 -0.044388 -0.051963
qa: -0.0350 -0.2864 -0.0505 0.4647 -0.3122 -0.0280 -0.2317 0.0007 0.7757 -0.1552 -0.1198 -0.0886 -0.1987 -0.1670 -0.0761 -0.1067 -0.2035 -0.1145 -0.0994 -0.1066 -0.2111 -0.2664 -0.0155 -0.2861 -0.0593 -0.0469 0.0822 0.0933 0.0946 0.0894 0.1028 0.0954 0.1427 0.1177 0.0349 -0.2638 0.0715 0.0819 0.0676 0.0570 0.0382 0.0409 0.0538 0.0605 0.0610 0.0808 0.0646 0.0493 0.0700 0.0418 0.0457 0.0565 0.0616 0.0585 0.0786 0.0518 0.0556 0.0540 0.0595 0.0481 0.0554 0.0557 0.0590 0.1402 0.1454 0.0982 0.1019 0.0902 0.0976 0.0959 0.0864
va: 3.8247 3.0339 3.8194 3.7867 3.0735 3.6611 3.6898 3.2767 4.3422 3.7099 3.8219 3.8540 3.9063 3.7227 3.8099 3.8430 3.9065 3.6623 3.8000 3.8274 3.8985 3.7318 3.6853 3.0328 3.8324 3.8239 0.9904 0.9810 0.9935 0.9898 0.9811 0.9859 0.9850 0.9990 0.9898 0.9369 0.9833 0.9857 0.9869 0.9898 0.9951 0.9960 0.9993 0.9959 0.9966 0.9925 0.9925 0.9916 0.9867 0.9953 0.9985 0.9961 0.9967 0.9986 0.9837 0.9852 0.9857 0.9982 0.9873 0.9931 0.9973 0.9981 0.9964 0.9795 0.9772 0.9843 0.9854 0.9896 0.9826 0.9867 0.9909
total: -1369.776357821 hartree
dispcorr: -0.055116036 hartree
energy: -1369.831473857627
dipole: -14.93521 20.83624 5.90102 1.32628 -0.94109 0.38519 5.91754 -5.35134 0.56620
magnitude: 5.94063 au
magnitude: 15.09987 debye
