program: Orca
programVersion: 5.0.3
elementType: C N C C N C C C P C C C C C C C C C C C C C C N C C H H H H H H H H H H H H H H H H H H H H H H H H H H H H H H H H H H H H H H H H H H H H H
charge: 1
multiplicity: 1
keywords: Freq RIJCOSX PBEh-3c
frequency: 0.00 0.00 0.00 0.00 0.00 0.00 15.42 19.18 21.23 30.93 42.65 48.70 60.57 69.16 74.17 78.32 83.79 97.92 105.90 110.09 116.56 131.61 140.45 148.75 160.34 163.36 170.28 181.90 187.67 199.39 207.11 214.01 218.47 235.75 237.57 251.51 256.07 257.59 261.40 268.32 282.80 292.92 321.55 326.35 338.16 355.23 377.45 387.84 404.87 416.13 440.78 455.84 494.23 514.23 538.63 589.54 653.36 656.38 676.52 691.80 715.41 728.76 741.53 745.81 758.90 763.30 771.52 778.77 784.52 812.88 835.93 901.59 915.63 922.42 934.77 938.83 942.34 944.78 949.36 951.43 981.91 1007.54 1015.68 1047.45 1057.16 1058.08 1064.50 1085.18 1091.16 1096.85 1100.07 1105.74 1109.41 1112.85 1114.83 1116.02 1119.58 1140.31 1144.96 1150.86 1157.31 1160.13 1179.99 1189.91 1194.38 1199.44 1200.19 1233.55 1257.36 1267.95 1270.55 1276.05 1288.86 1293.51 1295.00 1302.28 1326.25 1347.98 1352.23 1355.40 1366.87 1371.29 1374.20 1376.25 1378.26 1379.91 1382.25 1390.90 1413.00 1443.68 1445.97 1451.93 1455.02 1470.77 1470.90 1471.19 1490.30 1493.59 1498.59 1500.37 1503.23 1505.12 1512.49 1524.95 1531.44 1532.22 1533.36 1535.24 1536.80 1539.10 1540.00 1542.66 1542.77 1545.38 1552.27 1552.71 1553.11 1554.86 1555.41 1556.24 1556.38 1559.93 1561.93 1575.27 1674.55 1682.12 1712.40 1795.88 2243.10 3088.71 3092.19 3098.13 3102.25 3105.93 3111.22 3112.55 3114.47 3115.45 3117.68 3118.59 3120.13 3120.81 3121.31 3125.82 3126.62 3128.41 3131.41 3139.37 3155.10 3159.21 3160.10 3163.02 3183.05 3185.22 3185.77 3187.39 3190.18 3197.57 3198.11 3200.39 3201.24 3202.94 3209.44 3209.94 3211.24 3237.81 3238.38 3242.93 3246.36 3266.99 3271.11 3313.86 3336.78
frequency: 15.42 19.18 21.23 30.93 42.65 48.70 60.57 69.16 74.17 78.32 83.79 97.92 105.90 110.09 116.56 131.61 140.45 148.75 160.34 163.36 170.28 181.90 187.67 199.39 207.11 214.01 218.47 235.75 237.57 251.51 256.07 257.59 261.40 268.32 282.80 292.92 321.55 326.35 338.16 355.23 377.45 387.84 404.87 416.13 440.78 455.84 494.23 514.23 538.63 589.54 653.36 656.38 676.52 691.80 715.41 728.76 741.53 745.81 758.90 763.30 771.52 778.77 784.52 812.88 835.93 901.59 915.63 922.42 934.77 938.83 942.34 944.78 949.36 951.43 981.91 1007.54 1015.68 1047.45 1057.16 1058.08 1064.50 1085.18 1091.16 1096.85 1100.07 1105.74 1109.41 1112.85 1114.83 1116.02 1119.58 1140.31 1144.96 1150.86 1157.31 1160.13 1179.99 1189.91 1194.38 1199.44 1200.19 1233.55 1257.36 1267.95 1270.55 1276.05 1288.86 1293.51 1295.00 1302.28 1326.25 1347.98 1352.23 1355.40 1366.87 1371.29 1374.20 1376.25 1378.26 1379.91 1382.25 1390.90 1413.00 1443.68 1445.97 1451.93 1455.02 1470.77 1470.90 1471.19 1490.30 1493.59 1498.59 1500.37 1503.23 1505.12 1512.49 1524.95 1531.44 1532.22 1533.36 1535.24 1536.80 1539.10 1540.00 1542.66 1542.77 1545.38 1552.27 1552.71 1553.11 1554.86 1555.41 1556.24 1556.38 1559.93 1561.93 1575.27 1674.55 1682.12 1712.40 1795.88 2243.10 3088.71 3092.19 3098.13 3102.25 3105.93 3111.22 3112.55 3114.47 3115.45 3117.68 3118.59 3120.13 3120.81 3121.31 3125.82 3126.62 3128.41 3131.41 3139.37 3155.10 3159.21 3160.10 3163.02 3183.05 3185.22 3185.77 3187.39 3190.18 3197.57 3198.11 3200.39 3201.24 3202.94 3209.44 3209.94 3211.24 3237.81 3238.38 3242.93 3246.36 3266.99 3271.11 3313.86 3336.78
formula: C22H45N3P
InChI: InChI=1S/C12H28P.C10H17N3/c1-4-7-10-13(11-8-5-2)12-9-6-3;1-11(2)10(12(3)4)13-8-6-5-7-9-13/h13H,4-12H2,1-3H3;5-9H,1-4H3
71 atoms
C  5.42304 -0.747306 -1.123911
N  4.744767 0.533904 -1.045167
C  5.206136 1.547244 -1.974408
C  3.812163 0.800718 -0.111055
N  2.905221 -0.121599 0.215993
C  2.446582 -1.108971 -0.701341
C  1.41989 -1.908839 -0.392896
C  0.651703 -1.82002 0.841827
P  -1.464581 -0.972615 0.430059
C  -1.852358 -1.417992 2.181117
C  -3.202874 -0.914872 2.674086
C  -3.239813 0.593471 2.883124
C  -4.587651 1.079557 3.392429
C  -1.664583 -2.299358 -0.832491
C  -3.121791 -2.618754 -1.147675
C  -3.259005 -3.756388 -2.152897
C  -4.711898 -4.08705 -2.460069
C  -0.654964 0.614842 -0.037628
C  -1.536956 1.523938 -0.881072
C  -0.803087 2.782942 -1.327803
C  -1.662596 3.685029 -2.199453
C  1.378384 -1.033593 1.830544
C  2.397783 -0.221222 1.539293
N  3.800187 2.002953 0.493442
C  5.025697 2.707937 0.819841
C  2.568139 2.674759 0.857792
H  6.501064 -0.590653 -1.054858
H  5.124591 -1.400097 -0.308077
H  5.215844 -1.254905 -2.067414
H  4.524842 2.393946 -1.991033
H  5.235898 1.123687 -2.979224
H  6.20843 1.905774 -1.730889
H  2.95163 -1.147205 -1.651949
H  1.14907 -2.6459 -1.138356
H  0.344543 -2.793847 1.224531
H  -2.790855 -0.445766 0.189595
H  -1.792669 -2.508584 2.229048
H  -1.053993 -1.037359 2.818434
H  -3.42874 -1.4133 3.621024
H  -3.994064 -1.214638 1.981237
H  -2.45323 0.875582 3.589938
H  -3.001569 1.106388 1.944889
H  -5.384612 0.847572 2.684905
H  -4.844475 0.609362 4.342356
H  -4.59004 2.157577 3.54911
H  -1.144283 -3.192623 -0.482968
H  -1.138435 -1.963583 -1.731227
H  -3.623332 -1.727784 -1.532838
H  -3.649715 -2.885523 -0.225996
H  -2.753624 -4.647114 -1.768746
H  -2.7388 -3.487948 -3.0771
H  -4.788751 -4.89745 -3.183811
H  -5.246831 -4.398857 -1.56209
H  -5.237829 -3.226024 -2.874326
H  -0.364961 1.098438 0.899509
H  0.265052 0.373483 -0.569893
H  -2.434374 1.803563 -0.322866
H  -1.890721 0.980026 -1.763024
H  0.103072 2.500149 -1.87363
H  -0.469183 3.338054 -0.444987
H  -1.123035 4.582864 -2.49905
H  -2.562462 4.003322 -1.672199
H  -1.977985 3.172576 -3.108991
H  1.115557 -1.112032 2.878082
H  2.945159 0.327334 2.290186
H  4.9679 3.070072 1.847196
H  5.884251 2.044812 0.752513
H  5.190684 3.567441 0.167574
H  1.716929 2.215452 0.362972
H  2.623486 3.715486 0.535762
H  2.393132 2.659018 1.935099
totalener: -1368.20423922 hartree
nucrepener: 2793.97987674 hartree
electener: -4162.18411596 hartree
oneelecener: -7395.30399974 hartree
twoeener: 3233.11988378 hartree
kineticenergy: 1359.05351703 hartree
exchangeener: -96.105181774609 hartree
correlationener: -9.241165625257 hartree
xcener: -105.346347399867 hartree
chargesum: 1.0000000
charge: -0.542780 -0.459445 -0.523153 0.724224 -0.504318 -0.049565 -0.241893 -0.505571 0.629268 -0.620838 -0.424239 -0.423472 -0.638187 -0.631193 -0.406777 -0.413910 -0.642021 -0.634781 -0.406771 -0.417919 -0.638014 -0.246272 -0.051850 -0.448721 -0.526051 -0.539620 0.263221 0.274625 0.245951 0.252940 0.265480 0.242687 0.262754 0.244831 0.243440 0.035596 0.270336 0.254772 0.244285 0.228099 0.208798 0.209132 0.219759 0.222710 0.231326 0.253538 0.258393 0.228013 0.221874 0.214020 0.212573 0.236987 0.217428 0.217110 0.256646 0.263674 0.234476 0.222133 0.198287 0.204170 0.231259 0.223636 0.220381 0.243208 0.264624 0.266560 0.254388 0.244904 0.270057 0.261407 0.243374
charge: -0.248916 -0.121226 -0.245239 0.139896 -0.024622 -0.133083 -0.123775 -0.366980 0.756950 -0.375177 -0.250578 -0.249554 -0.359372 -0.376382 -0.250423 -0.245018 -0.360181 -0.385202 -0.249262 -0.246472 -0.359708 -0.126016 -0.124666 -0.115846 -0.245217 -0.248233 0.141406 0.153322 0.133345 0.144016 0.144139 0.131796 0.146535 0.148712 0.138396 -0.041421 0.151861 0.143972 0.137721 0.129318 0.120354 0.115352 0.129594 0.130793 0.133411 0.143734 0.147748 0.130048 0.126575 0.123547 0.123244 0.136037 0.128273 0.128099 0.146761 0.146119 0.130380 0.127319 0.115494 0.117878 0.133479 0.131480 0.129910 0.147267 0.145652 0.144542 0.144720 0.133035 0.145336 0.142206 0.132795
qa: -0.5428 -0.4594 -0.5232 0.7242 -0.5043 -0.0496 -0.2419 -0.5056 0.6293 -0.6208 -0.4242 -0.4235 -0.6382 -0.6312 -0.4068 -0.4139 -0.6420 -0.6348 -0.4068 -0.4179 -0.6380 -0.2463 -0.0518 -0.4487 -0.5261 -0.5396 0.2632 0.2746 0.2460 0.2529 0.2655 0.2427 0.2628 0.2448 0.2434 0.0356 0.2703 0.2548 0.2443 0.2281 0.2088 0.2091 0.2198 0.2227 0.2313 0.2535 0.2584 0.2280 0.2219 0.2140 0.2126 0.2370 0.2174 0.2171 0.2566 0.2637 0.2345 0.2221 0.1983 0.2042 0.2313 0.2236 0.2204 0.2432 0.2646 0.2666 0.2544 0.2449 0.2701 0.2614 0.2434
va: 3.6354 3.1415 3.6395 3.7232 3.3068 3.6538 3.8481 3.5369 4.1122 3.6606 3.7054 3.7405 3.7385 3.6681 3.7085 3.7562 3.7365 3.6570 3.7085 3.7672 3.7355 3.8643 3.6658 3.1504 3.6390 3.6337 0.8949 0.8958 0.8997 0.9070 0.8950 0.8995 0.8908 0.9132 0.8993 0.9599 0.8898 0.8975 0.8988 0.9068 0.9063 0.9068 0.9111 0.9105 0.9097 0.8980 0.8948 0.9045 0.9045 0.9045 0.9050 0.9081 0.9117 0.9118 0.8978 0.8886 0.9031 0.9043 0.9089 0.9064 0.9100 0.9101 0.9110 0.9131 0.8907 0.8939 0.9059 0.8986 0.8998 0.8960 0.9010
dispcorr: -0.052561915 hartree
energy: -1368.138321275515
dipole: -19.40503 22.59154 3.18652 7.63182 -6.53987 1.09195 -4.96334 4.71387 -0.24947
magnitude: 3.37764 au
magnitude: 8.58529 debye
temp: 298.15 k
press: 1.00 atm
zeropoint: 0.66538224 hartree
thermalvibcorrection: 0.03059286 hartree
thermalrotcorrection: 0.00141627 hartree
thermaltrasncorrection: 0.00141627 hartree
thermaltotal: -1367.43951363 hartree
thermalcorr: 0.03342540 hartree
nonthermalcorr: 0.66538224 hartree
totalcorr: 0.69880765 hartree
thermalcorrenthalpy: 0.00094421 hartree
totalenthalpy: -1367.43856942 hartree
totalentropycorr: -0.09416605 hartree
gibbsenthalpy: -1367.53273547 hartree
gibbsminuselec: 0.60558581 hartree
