program: Orca
programVersion: 5.0.3
elementType: C N C C N C C C P C C C C C C C C F C C C C C C N C C H H H H H H H H H H H H H H H H H H H H H H H H H H H H H H H H H H H H H H H H H H H H
charge: 1
multiplicity: 1
keywords: Opt RIJCOSX PBEh-3c CPCM(Acetonitrile)
formula: C22H44FN3P
InChI: InChI=1S/C22H44FN3P/c1-8-11-18-27(23,19-12-9-2,20-13-10-3)21-14-16-26(17-15-21)22(24(4)5)25(6)7/h14-17,21H,8-13,18-20H2,1-7H3
71 atoms
C  4.679532 -0.706592 2.769181
N  3.499417 -0.25067 2.05309
C  2.323997 -0.010475 2.875172
C  3.500504 -0.065636 0.734792
N  2.368968 -0.312675 0.034563
C  1.547147 -1.414727 0.346468
C  0.393002 -1.630484 -0.27764
C  -0.196547 -0.716425 -1.296637
P  -1.875374 0.150156 -0.70094
C  -1.054659 1.176599 0.589377
C  -0.858559 2.633489 0.17376
C  -0.114443 3.421034 1.246496
C  0.113719 4.87377 0.854807
C  -2.662317 -1.442898 -0.203102
C  -2.665006 -1.637578 1.313539
C  -3.262098 -2.980848 1.716064
C  -3.255126 -3.1895 3.223943
F  -3.399344 0.930294 -0.179952
C  -2.234114 0.876728 -2.363525
C  -3.447749 0.270834 -3.071512
C  -3.19024 -1.10121 -3.683484
C  -4.412473 -1.646282 -4.407602
C  0.839187 0.271752 -1.713573
C  1.992817 0.464323 -1.081197
N  4.592999 0.353488 0.098683
C  4.947587 -0.104115 -1.235291
C  5.53785 1.274833 0.708652
H  5.411384 -1.124105 2.083384
H  4.378019 -1.494437 3.459162
H  5.138717 0.098208 3.343781
H  1.592251 0.589156 2.341315
H  2.633955 0.546056 3.759248
H  1.860323 -0.943021 3.197734
H  1.953022 -2.107804 1.068687
H  -0.122735 -2.547061 -0.024051
H  -0.524693 -1.303738 -2.164974
H  -1.665896 1.132118 1.491592
H  -0.090805 0.735864 0.837275
H  -1.827116 3.10032 -0.019985
H  -0.292343 2.687962 -0.760077
H  0.847101 2.936319 1.444896
H  -0.676314 3.376224 2.184176
H  -0.832585 5.388142 0.679138
H  0.645869 5.418555 1.635172
H  0.703222 4.94751 -0.060717
H  -2.149537 -2.275386 -0.685297
H  -3.687766 -1.442896 -0.575191
H  -1.645172 -1.571699 1.704626
H  -3.229276 -0.830616 1.786185
H  -4.285821 -3.051264 1.336743
H  -2.700777 -3.785144 1.231219
H  -3.826124 -2.410997 3.732928
H  -3.69132 -4.151039 3.495866
H  -2.238203 -3.164046 3.619455
H  -1.365284 0.786116 -3.013262
H  -2.395188 1.943004 -2.198263
H  -3.738724 0.95567 -3.87382
H  -4.302393 0.225989 -2.394118
H  -2.347942 -1.029384 -4.377642
H  -2.882907 -1.812442 -2.911994
H  -4.212547 -2.621581 -4.85179
H  -5.255014 -1.760148 -3.723153
H  -4.729034 -0.976232 -5.209076
H  0.650994 0.911882 -2.565563
H  2.683582 1.240268 -1.373589
H  5.979511 -0.45505 -1.216842
H  4.315376 -0.930348 -1.548185
H  4.869707 0.703494 -1.963511
H  5.795171 2.034749 -0.028815
H  5.094582 1.773558 1.566244
H  6.453848 0.770086 1.016958
totalener: -1467.40049944 hartree
nucrepener: 3059.82214425 hartree
electener: -4527.22264368 hartree
oneelecener: -8064.40664708 hartree
twoeener: 3537.18400339 hartree
cpcmener: -0.08220198 hartree
kineticenergy: 1457.53492206 hartree
exchangeener: -101.594532865369 hartree
correlationener: -9.644321663999 hartree
xcener: -111.238854529368 hartree
elementType: C N P F H
chargesum: 1.0000000
charge: -0.542002 -0.435439 -0.555107 0.774593 -0.540531 -0.022544 -0.292682 -0.542971 1.090515 -0.639363 -0.412397 -0.420499 -0.659962 -0.653805 -0.414460 -0.416768 -0.660627 -0.554346 -0.643248 -0.421771 -0.434471 -0.656697 -0.299655 -0.007876 -0.442282 -0.549928 -0.540666 0.271007 0.277277 0.260305 0.280721 0.277008 0.260322 0.306409 0.272382 0.276104 0.264732 0.249452 0.227812 0.222379 0.216869 0.215213 0.217876 0.227243 0.216708 0.246860 0.273894 0.223088 0.231604 0.216884 0.215405 0.217601 0.228014 0.216521 0.248781 0.275492 0.234277 0.229992 0.216954 0.224855 0.227594 0.217523 0.217551 0.270951 0.301966 0.276318 0.275581 0.260782 0.276193 0.271579 0.258915
charge: -0.245521 -0.086767 -0.247305 0.173455 -0.049745 -0.086257 -0.160464 -0.307177 0.916017 -0.360263 -0.244212 -0.245684 -0.368114 -0.364214 -0.246037 -0.245843 -0.367881 -0.489468 -0.360900 -0.244425 -0.252798 -0.366829 -0.159964 -0.085086 -0.090947 -0.248403 -0.245449 0.152569 0.150691 0.142042 0.148843 0.151078 0.142038 0.163301 0.157238 0.147366 0.148233 0.132975 0.128504 0.126047 0.122596 0.124175 0.127077 0.129960 0.126437 0.134756 0.149359 0.125483 0.130568 0.124638 0.123557 0.126920 0.130214 0.126391 0.135311 0.152607 0.132118 0.129473 0.123459 0.121828 0.129972 0.126931 0.126785 0.155837 0.163136 0.149829 0.153952 0.141610 0.150441 0.152741 0.141196
qa: -0.5420 -0.4354 -0.5551 0.7746 -0.5405 -0.0225 -0.2927 -0.5430 1.0905 -0.6394 -0.4124 -0.4205 -0.6600 -0.6538 -0.4145 -0.4168 -0.6606 -0.5543 -0.6432 -0.4218 -0.4345 -0.6567 -0.2997 -0.0079 -0.4423 -0.5499 -0.5407 0.2710 0.2773 0.2603 0.2807 0.2770 0.2603 0.3064 0.2724 0.2761 0.2647 0.2495 0.2278 0.2224 0.2169 0.2152 0.2179 0.2272 0.2167 0.2469 0.2739 0.2231 0.2316 0.2169 0.2154 0.2176 0.2280 0.2165 0.2488 0.2755 0.2343 0.2300 0.2170 0.2249 0.2276 0.2175 0.2176 0.2710 0.3020 0.2763 0.2756 0.2608 0.2762 0.2716 0.2589
va: 3.6103 3.1997 3.6030 3.7142 3.2504 3.6787 3.8027 3.6288 4.1353 3.7145 3.7147 3.7505 3.7365 3.7203 3.7055 3.7507 3.7372 0.7689 3.7114 3.7058 3.7368 3.7357 3.8071 3.6672 3.1960 3.6133 3.6093 0.8977 0.8892 0.8929 0.8937 0.8901 0.8934 0.8694 0.9022 0.8771 0.8973 0.8821 0.9085 0.9053 0.9043 0.9053 0.9113 0.9104 0.9118 0.8943 0.8912 0.9051 0.9087 0.9045 0.9048 0.9114 0.9102 0.9118 0.8927 0.8905 0.8997 0.9129 0.9043 0.8994 0.9102 0.9115 0.9119 0.9042 0.8717 0.8901 0.8949 0.8932 0.8903 0.8977 0.8935
dispcorr: -0.054254284 hartree
energy: -1467.327825911681
dipole: 1.16938 5.97529 7.14467 -0.83998 0.37231 -0.46767 4.79369 -3.43740 1.35629
magnitude: 7.28728 au
magnitude: 18.52280 debye
