program: Orca
programVersion: 5.0.3
elementType: C N C N C C C C C P C C C C C C C C C C C C N C C C H H H H H H H H H H H H H H H H H H H H H H H H H H H H H H H H H H H H H H H H H H H H H
charge: 1
multiplicity: 1
keywords: Opt RIJCOSX PBEh-3c
formula: C22H45N3P
InChI: InChI=1S/C22H45N3P/c1-8-11-18-26(19-12-9-2,20-13-10-3)21-14-16-25(17-15-21)22(23(4)5)24(6)7/h14-17,21-22H,8-13,18-20H2,1-7H3
71 atoms
C  6.170131 -0.795844 0.756962
N  4.91782 -0.058237 0.683268
C  4.032922 -0.550872 -0.337849
N  2.756786 0.195683 -0.268322
C  2.226944 0.783208 -1.385399
C  1.081835 1.477279 -1.393139
C  0.238385 1.618487 -0.160932
C  1.01141 1.165762 1.042996
C  2.15993 0.48824 0.935957
P  -1.334714 0.654708 -0.351045
C  -2.220986 1.24412 -1.820797
C  -2.566089 2.733524 -1.774636
C  -3.417359 3.180127 -2.9619
C  -4.818904 2.586614 -2.974322
C  -0.975043 -1.110144 -0.579837
C  -0.787067 -1.918091 0.704894
C  -0.481304 -3.381109 0.403716
C  -0.273039 -4.195601 1.671337
C  -2.379287 0.912557 1.107826
C  -3.781379 0.314056 0.977652
C  -4.597717 0.450347 2.261023
C  -4.855869 1.891109 2.677853
N  3.87349 -1.967939 -0.257323
C  3.276958 -2.553764 -1.430132
C  3.309939 -2.4861 0.967862
C  5.182767 1.363448 0.544138
H  6.768687 -0.713834 -0.161008
H  6.76238 -0.3925 1.576857
H  6.003568 -1.850661 0.950826
H  4.419691 -0.339918 -1.350926
H  2.82017 0.696485 -2.28654
H  0.789995 1.986466 -2.301003
H  -0.102294 2.654462 -0.031958
H  0.657037 1.432026 2.029221
H  2.718436 0.190732 1.812297
H  -3.118523 0.628093 -1.915959
H  -1.597266 1.016003 -2.689804
H  -3.101665 2.970047 -0.849851
H  -1.645321 3.32204 -1.757088
H  -3.489355 4.268837 -2.931456
H  -2.899737 2.939828 -3.894416
H  -5.404366 2.99611 -3.796058
H  -5.353967 2.814024 -2.050614
H  -4.817031 1.503192 -3.102051
H  -0.075534 -1.154593 -1.202694
H  -1.786466 -1.53285 -1.178997
H  -1.6895 -1.864342 1.319981
H  0.021167 -1.487938 1.300457
H  0.410403 -3.44143 -0.226906
H  -1.298455 -3.81076 -0.182708
H  0.564207 -3.811439 2.255893
H  -1.157831 -4.172946 2.308427
H  -0.062356 -5.238643 1.440651
H  -2.426809 1.990644 1.280809
H  -1.85069 0.486455 1.965316
H  -3.711818 -0.743874 0.709789
H  -4.317068 0.805887 0.160304
H  -4.09576 -0.088285 3.069395
H  -5.551607 -0.058121 2.107871
H  -3.943447 2.411564 2.972067
H  -5.528178 1.930937 3.533422
H  -5.321565 2.461292 1.87205
H  3.802832 -2.232167 -2.330056
H  3.360792 -3.639188 -1.379324
H  2.209336 -2.309865 -1.554516
H  3.478531 -3.562333 1.01553
H  3.791969 -2.037243 1.834545
H  2.225284 -2.3212 1.055412
H  4.276643 1.959829 0.636343
H  5.854498 1.679737 1.340131
H  5.660623 1.617668 -0.413614
totalener: -1368.27119171 hartree
nucrepener: 2845.10942453 hartree
electener: -4213.38061624 hartree
oneelecener: -7496.64375438 hartree
twoeener: 3283.26313814 hartree
kineticenergy: 1359.18328528 hartree
exchangeener: -96.126880505843 hartree
correlationener: -9.248029274789 hartree
xcener: -105.374909780632 hartree
chargesum: 1.0000000
charge: -0.508587 -0.438726 0.271154 -0.511148 0.066678 -0.367479 -0.464965 -0.350867 0.048713 0.863113 -0.657473 -0.443950 -0.424606 -0.652845 -0.656467 -0.434387 -0.427265 -0.644105 -0.668176 -0.441226 -0.423974 -0.655634 -0.391311 -0.515694 -0.556882 -0.519787 0.202837 0.233793 0.255638 0.206847 0.271165 0.250337 0.289725 0.251527 0.299917 0.284119 0.286004 0.228241 0.244875 0.249367 0.224935 0.257603 0.216708 0.207128 0.294540 0.276215 0.230277 0.247150 0.222261 0.227569 0.215297 0.222010 0.245465 0.285707 0.287321 0.238282 0.235461 0.223874 0.248817 0.209978 0.257255 0.217104 0.234589 0.247458 0.181890 0.250272 0.254009 0.202568 0.242478 0.245705 0.201578
charge: -0.256437 -0.220812 0.078792 -0.092945 -0.036961 -0.246563 -0.240666 -0.235136 -0.041390 0.890509 -0.372669 -0.249258 -0.242352 -0.364994 -0.369467 -0.249789 -0.245388 -0.359232 -0.375364 -0.248434 -0.242559 -0.365252 -0.197101 -0.256170 -0.265414 -0.259925 0.108861 0.130732 0.136963 0.106035 0.149438 0.147305 0.151586 0.147786 0.162575 0.156888 0.160665 0.127874 0.133454 0.139988 0.129583 0.146002 0.127563 0.120874 0.165152 0.156726 0.127422 0.135132 0.124354 0.128534 0.126314 0.130445 0.140566 0.158115 0.161029 0.130768 0.130339 0.128464 0.139592 0.122396 0.145705 0.127939 0.129228 0.136602 0.090742 0.135533 0.137254 0.099263 0.129557 0.136635 0.106996
qa: -0.5086 -0.4387 0.2712 -0.5111 0.0667 -0.3675 -0.4650 -0.3509 0.0487 0.8631 -0.6575 -0.4439 -0.4246 -0.6528 -0.6565 -0.4344 -0.4273 -0.6441 -0.6682 -0.4412 -0.4240 -0.6556 -0.3913 -0.5157 -0.5569 -0.5198 0.2028 0.2338 0.2556 0.2068 0.2712 0.2503 0.2897 0.2515 0.2999 0.2841 0.2860 0.2282 0.2449 0.2494 0.2249 0.2576 0.2167 0.2071 0.2945 0.2762 0.2303 0.2471 0.2223 0.2276 0.2153 0.2220 0.2455 0.2857 0.2873 0.2383 0.2355 0.2239 0.2488 0.2100 0.2573 0.2171 0.2346 0.2475 0.1819 0.2503 0.2540 0.2026 0.2425 0.2457 0.2016
va: 3.6903 2.9968 3.7336 3.1953 3.7609 3.7533 3.6876 3.7471 3.7207 3.8991 3.6629 3.6811 3.7343 3.7204 3.6648 3.6707 3.7394 3.7290 3.6598 3.6844 3.7349 3.7189 3.0144 3.7062 3.6875 3.6837 0.9125 0.9097 0.9040 0.9182 0.8879 0.9137 0.8681 0.9125 0.8842 0.8859 0.8847 0.9025 0.8966 0.8952 0.9017 0.9010 0.9121 0.9146 0.8838 0.8865 0.9003 0.9005 0.9042 0.9002 0.9135 0.9103 0.9057 0.8843 0.8847 0.8988 0.8997 0.9023 0.8960 0.9134 0.9014 0.9117 0.9117 0.9068 0.9144 0.9043 0.9088 0.9060 0.9021 0.9091 0.9134
dispcorr: -0.054385666 hartree
energy: -1368.203925196244
dipole: -14.98560 13.65009 -1.33550 -5.88454 6.24475 0.36021 3.04206 -3.54049 -0.49843
magnitude: 1.47029 au
magnitude: 3.73718 debye
