program: Orca
programVersion: 5.0.3
elementType: C N C C N C C C P C C C C C C C C C C C C C C N C C H H H H H H H H H H H H H H H H H H H H H H H H H H H H H H H H H H H H H H H H H H H H
charge: 2
multiplicity: 1
keywords: Opt RIJCOSX PBEh-3c CPCM(Acetonitrile)
formula: C22H44N3P
InChI: InChI=1S/C22H44N3P/c1-8-11-18-26(19-12-9-2,20-13-10-3)21-14-16-25(17-15-21)22(23(4)5)24(6)7/h14-17,21H,8-13,18-20H2,1-7H3
70 atoms
C  2.862839 0.746877 -2.474002
N  4.060293 0.595827 -1.657714
C  5.280894 1.13118 -2.244168
C  4.03775 0.03137 -0.460033
N  2.896417 0.136212 0.289431
C  2.407097 -0.94748 1.030962
C  1.266977 -0.883165 1.709837
C  0.388131 0.330059 1.703581
P  -1.166574 -0.007764 0.753802
C  -2.029035 -1.39339 1.542712
C  -3.509503 -1.51192 1.17891
C  -4.144922 -2.731673 1.83519
C  -5.622488 -2.85725 1.494518
C  -0.672162 -0.381258 -0.94416
C  -1.789014 -0.813227 -1.891333
C  -1.279454 -0.89771 -3.325821
C  -2.352793 -1.367168 -4.295798
C  -2.181972 1.489752 0.769609
C  -2.539201 1.979473 2.17355
C  -3.479387 3.181433 2.1404
C  -2.858927 4.425621 1.520284
C  1.105551 1.497589 1.099702
C  2.23996 1.366892 0.421015
N  5.075616 -0.627321 0.034618
C  5.386448 -0.643129 1.457997
C  6.003138 -1.36759 -0.808443
H  2.503373 1.775828 -2.462643
H  2.073262 0.082645 -2.136123
H  3.114305 0.478394 -3.498949
H  5.675365 0.476468 -3.020567
H  6.037504 1.292732 -1.481868
H  5.041275 2.094207 -2.692533
H  3.002146 -1.848414 1.009068
H  0.959953 -1.751349 2.276527
H  0.049381 0.56428 2.719204
H  -1.911291 -1.266466 2.622739
H  -1.483968 -2.300352 1.266804
H  -3.634789 -1.580115 0.096458
H  -4.04321 -0.612758 1.497475
H  -4.017663 -2.666803 2.919408
H  -3.612628 -3.631854 1.51548
H  -6.180064 -1.980822 1.828696
H  -6.06492 -3.732624 1.969934
H  -5.771478 -2.953168 0.417874
H  -0.18785 0.528766 -1.310852
H  0.098243 -1.154816 -0.884177
H  -2.629092 -0.114942 -1.846452
H  -2.174258 -1.78913 -1.587112
H  -0.905596 0.083685 -3.630969
H  -0.42272 -1.576639 -3.363586
H  -2.725554 -2.356186 -4.024558
H  -1.966619 -1.426954 -5.313372
H  -3.204229 -0.684663 -4.304916
H  -1.622875 2.241475 0.206876
H  -3.085124 1.273714 0.191563
H  -3.010391 1.173475 2.741234
H  -1.63129 2.253947 2.717553
H  -4.393076 2.909402 1.604555
H  -3.780777 3.402296 3.16668
H  -3.540643 5.273722 1.584268
H  -1.937887 4.702063 2.036928
H  -2.617154 4.285842 0.465787
H  0.696713 2.490332 1.229267
H  2.751753 2.219489 -0.002268
H  5.235731 -1.637249 1.87787
H  4.780847 0.075688 2.001784
H  6.433623 -0.368911 1.582208
H  6.946211 -0.836404 -0.933008
H  6.205339 -2.322592 -0.325121
H  5.564445 -1.567478 -1.781913
totalener: -1367.59503661 hartree
nucrepener: 2775.32249361 hartree
electener: -4142.91753022 hartree
oneelecener: -7329.26308322 hartree
twoeener: 3186.34555300 hartree
cpcmener: -0.23065920 hartree
kineticenergy: 1358.39443942 hartree
exchangeener: -95.794773553348 hartree
correlationener: -9.163146563917 hartree
xcener: -104.957920117265 hartree
elementType: C N P H
chargesum: 2.0000000
charge: -0.551999 -0.424843 -0.546531 0.781662 -0.561376 0.041654 -0.328096 -0.503347 0.867516 -0.673497 -0.434511 -0.416979 -0.661858 -0.649315 -0.426035 -0.416060 -0.662368 -0.678314 -0.443897 -0.428050 -0.669339 -0.331598 0.031913 -0.431463 -0.551893 -0.544218 0.267356 0.278680 0.284826 0.268578 0.275891 0.284515 0.324321 0.300776 0.341323 0.305693 0.306731 0.249573 0.246093 0.224446 0.224328 0.220595 0.232468 0.220729 0.295250 0.300895 0.243110 0.245514 0.224564 0.223238 0.220832 0.232214 0.220854 0.310177 0.308823 0.255647 0.247331 0.225499 0.237174 0.236339 0.220786 0.223230 0.300692 0.327137 0.267939 0.279485 0.283675 0.267503 0.282826 0.275185
charge: -0.246597 -0.071622 -0.244154 0.183717 -0.056171 -0.047852 -0.178999 -0.248627 0.911754 -0.371117 -0.246802 -0.243129 -0.366689 -0.368896 -0.245887 -0.243909 -0.367042 -0.372659 -0.247791 -0.243359 -0.371070 -0.180586 -0.046175 -0.076503 -0.247189 -0.244062 0.146679 0.151776 0.155628 0.146847 0.155162 0.155200 0.174641 0.171462 0.179281 0.171463 0.172622 0.136006 0.135692 0.128402 0.128220 0.128615 0.132873 0.128647 0.167947 0.169444 0.135496 0.136944 0.127937 0.127931 0.128781 0.132953 0.128774 0.170090 0.171308 0.138633 0.135791 0.128474 0.133518 0.134464 0.128703 0.127374 0.171002 0.174787 0.146106 0.155811 0.154459 0.146179 0.154449 0.154845
qa: -0.5520 -0.4248 -0.5465 0.7817 -0.5614 0.0417 -0.3281 -0.5033 0.8675 -0.6735 -0.4345 -0.4170 -0.6619 -0.6493 -0.4260 -0.4161 -0.6624 -0.6783 -0.4439 -0.4280 -0.6693 -0.3316 0.0319 -0.4315 -0.5519 -0.5442 0.2674 0.2787 0.2848 0.2686 0.2759 0.2845 0.3243 0.3008 0.3413 0.3057 0.3067 0.2496 0.2461 0.2244 0.2243 0.2206 0.2325 0.2207 0.2952 0.3009 0.2431 0.2455 0.2246 0.2232 0.2208 0.2322 0.2209 0.3102 0.3088 0.2556 0.2473 0.2255 0.2372 0.2363 0.2208 0.2232 0.3007 0.3271 0.2679 0.2795 0.2837 0.2675 0.2828 0.2752
va: 3.5960 3.2253 3.5953 3.7139 3.2334 3.6494 3.7666 3.6627 3.9374 3.6557 3.6722 3.7471 3.7341 3.6626 3.6887 3.7456 3.7353 3.6418 3.6682 3.7429 3.7204 3.7622 3.6608 3.2211 3.5968 3.5944 0.8901 0.8934 0.8868 0.8895 0.8949 0.8866 0.8599 0.8888 0.8438 0.8715 0.8724 0.8939 0.8946 0.9015 0.9015 0.9103 0.9091 0.9102 0.8787 0.8760 0.8964 0.8944 0.9013 0.9016 0.9102 0.9090 0.9101 0.8717 0.8729 0.8922 0.8949 0.9017 0.8997 0.9073 0.9105 0.9094 0.8900 0.8582 0.8903 0.8928 0.8870 0.8900 0.8879 0.8956
dispcorr: -0.051830046 hartree
energy: -1367.531467124521
dipole: -18.83179 23.75087 4.91908 -1.01326 0.97582 -0.03744 -8.33705 7.86304 -0.47401
magnitude: 4.94201 au
magnitude: 12.56159 debye
