program: Orca
programVersion: 5.0.3
elementType: C Si C C H H H H H H H H H H
charge: 0
multiplicity: 1
keywords: Freq RIJCOSX PBEh-3c
frequency: 0.00 0.00 0.00 0.00 0.00 0.00 149.88 163.84 164.38 201.56 202.07 240.08 630.71 642.89 643.97 717.76 723.36 723.60 888.99 889.38 916.74 946.95 947.35 1350.19 1350.52 1359.27 1508.78 1512.48 1512.52 1522.44 1522.52 1530.54 2255.81 3114.11 3116.46 3116.92 3201.91 3202.07 3203.03 3207.09 3207.60 3207.80
frequency: 149.88 163.84 164.38 201.56 202.07 240.08 630.71 642.89 643.97 717.76 723.36 723.60 888.99 889.38 916.74 946.95 947.35 1350.19 1350.52 1359.27 1508.78 1512.48 1512.52 1522.44 1522.52 1530.54 2255.81 3114.11 3116.46 3116.92 3201.91 3202.07 3203.03 3207.09 3207.60 3207.80
formula: C3H10Si
InChI: InChI=1S/C3H10Si/c1-4(2)3/h4H,1-3H3
14 atoms
C  -1.111519 -1.335828 0.415143
Si -0.073946 -0.050117 -0.491373
C  1.756755 -0.314704 -0.126797
C  -0.595611 1.68269 0.034337
H  -2.175447 -1.205528 0.213513
H  -0.971862 -1.263379 1.495057
H  -0.844607 -2.35062 0.11792
H  -0.298718 -0.197166 -1.958143
H  2.380037 0.402402 -0.662408
H  2.084172 -1.313404 -0.418399
H  1.967072 -0.199314 0.937801
H  -1.649013 1.866086 -0.180093
H  -0.449161 1.828638 1.105809
H  -0.018153 2.450345 -0.482367
totalener: -409.24632905 hartree
nucrepener: 174.64444394 hartree
electener: -583.89077299 hartree
oneelecener: -908.14280634 hartree
twoeener: 324.25203335 hartree
kineticenergy: 407.60489606 hartree
exchangeener: -22.015255242710 hartree
correlationener: -1.855315768412 hartree
xcener: -23.870571011122 hartree
energy: -1815.5593 -283.3278 -283.3242 -283.3229 -149.5421 -103.0498 -103.0405 -103.0401 -21.6348 -20.6420 -20.6381 -14.5625 -12.8556 -12.5516 -12.5461 -12.0663 -12.0625 -11.7914 -9.6488 -9.4970 -9.4918 3.1270 3.1350 3.1398 4.3161 4.6233 4.6284 5.5375 6.0826 6.0946 6.1202 6.4882 6.5072 6.9125 10.5492 12.6086 12.6127 12.6885 12.9724 12.9791 15.9939 16.0082 16.1875 17.5059 17.8137 17.8270 18.5947 18.5991 19.8001 21.1369 25.1562 25.1836 27.4832 27.7562 27.7626 28.2134 28.8605 29.1628 29.1692 30.5756 30.5916 33.2577 34.6533 34.6966 39.1532 46.9926 48.3746 48.3866 51.0138 51.0291 51.9778 58.1061 61.2375 61.2514 63.6436 63.7174 63.7247 63.8700 64.3072 64.3129 372.9993 374.0275 374.0546 electronvolt
chargesum: 0.0000000
charge: -0.943287 0.775751 -0.943271 -0.942822 0.234543 0.230464 0.234643 -0.044991 0.234622 0.234524 0.230401 0.234551 0.230403 0.234468
charge: -0.574304 0.483309 -0.574324 -0.574149 0.144047 0.141993 0.143957 -0.050317 0.144034 0.143949 0.141922 0.143996 0.141969 0.143920
qa: -0.9433 0.7758 -0.9433 -0.9428 0.2345 0.2305 0.2346 -0.0450 0.2346 0.2345 0.2304 0.2346 0.2304 0.2345
va: 3.6983 3.8628 3.6983 3.6983 0.9069 0.9079 0.9069 0.9824 0.9068 0.9069 0.9079 0.9069 0.9079 0.9069
dispcorr: -0.005448273 hartree
energy: -409.240392160009
dipole: 0.21005 -0.17682 0.03323 0.14586 -0.12527 0.02059 1.41218 -1.20039 0.21179
magnitude: 0.21536 au
magnitude: 0.54741 debye
temp: 298.15 k
press: 1.00 atm
zeropoint: 0.12255527 hartree
thermalvibcorrection: 0.00453829 hartree
thermalrotcorrection: 0.00141627 hartree
thermaltrasncorrection: 0.00141627 hartree
thermaltotal: -409.11046606 hartree
thermalcorr: 0.00737083 hartree
nonthermalcorr: 0.12255527 hartree
totalcorr: 0.12992610 hartree
thermalcorrenthalpy: 0.00094421 hartree
totalenthalpy: -409.10952185 hartree
totalentropycorr: -0.03848344 hartree
gibbsenthalpy: -409.14800529 hartree
gibbsminuselec: 0.09238687 hartree
