program: Orca
programVersion: 5.0.3
elementType: C Si C C H H H H H H H H H
charge: 1
multiplicity: 1
keywords: SP DSD-BLYP D3BJ def2-QZVPP def2-QZVPP/C def2/J TightSCF
formula: C3H9Si
InChI: InChI=1S/C3H9Si/c1-4(2)3/h1-3H3
13 atoms
C  -1.373873 -1.206563 -0.105692
Si -0.000207 0.000873 -0.002164
C  -0.360594 1.789221 0.166583
C  1.734883 -0.583968 -0.057665
H  -1.259702 -1.849725 -0.98321
H  -2.357381 -0.740892 -0.137123
H  -1.342962 -1.881873 0.756417
H  0.533791 2.404255 0.248215
H  -0.990324 1.970798 1.043317
H  -0.945597 2.141522 -0.689307
H  2.290918 -0.222217 0.812617
H  2.2492 -0.162495 -0.927939
H  1.822857 -1.668094 -0.101127
totalener: -408.34776597 hartree
nucrepener: 166.18068321 hartree
electener: -574.52844919 hartree
oneelecener: -881.54499128 hartree
twoeener: 307.01654209 hartree
kineticenergy: 407.69101553 hartree
exchangeener: -12.060465746304 hartree
correlationener: -0.742408221775 hartree
xcener: -12.802873968079 hartree
chargesum: 1.0000000
charge: -0.273712 0.807843 -0.276412 -0.276160 0.110648 0.118685 0.108890 0.118516 0.111791 0.110224 0.112104 0.111414 0.116170
charge: 0.252300 0.573502 0.252144 0.252136 -0.034829 -0.042257 -0.032934 -0.042311 -0.034005 -0.033734 -0.034472 -0.033299 -0.042242
qa: -0.2737 0.8078 -0.2764 -0.2762 0.1106 0.1187 0.1089 0.1185 0.1118 0.1102 0.1121 0.1114 0.1162
va: 3.9233 3.6071 3.9252 3.9242 1.0061 1.0006 1.0077 1.0014 1.0064 1.0071 1.0062 1.0067 1.0017
total: -408.680935981 hartree
dispcorr: -0.007524199 hartree
energy: -408.688460179667
dipole: 0.00076 -0.00179 -0.00103 -0.00823 0.00913 0.00090 0.02063 -0.02250 -0.00187
magnitude: 0.00232 au
magnitude: 0.00589 debye
