program: Gaussian 16
title: [6+4] or [2+4} they proposed ts guess
version: ES64L-G16RevC.01
frameworkgroup: C1[X(C7H7O2)]
method: RM062X
basis: def2SVP
operation: Freq
keyword: #N
keyword: Geom=AllCheck
keyword: Guess=TCheck
keyword: SCRF=Check
keyword: GenChk
keyword: RM062X/def2SVP
keyword: Freq
converged: YES YES YES YES
title: Mulliken charges:
elementType: C C C C C C H H H H H C O O H H
charge: 0.006215 -0.032474 0.025115 -0.127302 0.025101 -0.032466 0.071952 0.067169 0.071285 0.071290 0.067168 0.382718 -0.106434 -0.106438 0.308550 0.308553
chargesum: 1.00000
title: Mulliken charges with hydrogens summed into heavy atoms:
elementType: C C C C C C C O O
charge: 0.078167 0.034695 0.096400 -0.127302 0.096392 0.034702 0.382718 0.202118 0.202112
1716.lowfreq: -60.1268 -0.0003 0.0008 0.0010 36.9040 38.7594 82.5975 119.7594 234.9884
frequency: 81.0572 112.9390 234.6648 392.0909 401.1977 408.1030 500.9817 524.4475 534.5521 621.7242 670.2949 703.3357 739.1219 823.9261 835.9257 878.4176 995.1565 1013.4667 1035.5187 1057.7431 1065.6012 1115.6244 1142.8228 1156.2358 1177.3673 1191.3966 1272.6304 1331.7601 1380.6894 1487.0085 1519.5661 1607.1352 1614.9857 1679.6422 1687.8897 3232.1067 3242.7846 3246.2349 3254.1096 3255.7907 3684.2511 3696.8083
redmass: 7.2178 3.0706 4.7249 1.9796 7.0304 2.7530 3.2643 1.0592 2.3848 6.3654 4.8123 1.9115 2.3339 4.3213 2.8837 1.2541 1.4138 5.4432 1.3905 2.1211 1.3779 1.3888 1.1038 1.0768 1.1458 3.8264 1.6926 1.3232 7.5492 2.6831 2.2413 3.3269 9.4230 7.2520 6.3871 1.0895 1.0918 1.0953 1.0977 1.1005 1.0677 1.0674
irintensity: 0.1392 62.8020 9.8111 154.2299 2.2426 0.0489 74.7206 10.4360 111.2455 0.3477 45.1664 30.7780 182.5568 19.2581 0.3839 0.5479 1.1039 6.8265 0.7489 9.4376 0.1337 19.9902 398.2925 0.3691 61.5762 27.3105 671.1010 0.2628 50.7864 0.9635 89.8482 761.1002 648.3510 112.1978 152.7262 0.5410 2.4249 0.0083 1.0652 3.3016 63.0850 1268.8319
temp: 298.150 k
press: 1.00000 atm
elementType: 6 6 6 6 6 6 1 1 1 1 1 6 8 8 1 1
symmnumber: 1
zpe: 338585.7 jmol-1
zpe.correction: 0.128960 hartree
zpe.thermalcorrener: 0.136335 hartree
zpe.thermalcorrenthalpy: 0.137279 hartree
zpe.thermalcorrgfe: 0.096748 hartree
zpe.sumelectzpe: -420.639507 hartree
zpe.sumelectthermal: -420.632133 hartree
zpe.sumelectthermalent: -420.631189 hartree
zpe.sumelectthermalfe: -420.671720 hartree
dipole: -8.9613 -0.0006 -0.0040
dipole: 8.9613
quadrupole: -1.8535 -41.3690 -53.1381
quadrupole: 0.0023 0.0109 0.5388
quadrupole: 30.2667 -9.2488 -21.0179 0.0023 0.0109 0.5388
hfenergy: -420.7684678 hartree
pointgroup: C01 [X(C7H7O2)]
dipole: 1.8471382 3.0026935 -0.0450381 debye
dipolederiv: 0.2577166 -0.0275513 -0.0692545 -0.0275956 0.2319862 0.0389216 -0.0687779 0.0386017 -0.0468537 -0.5204616 -0.2414754 0.0480061 -0.3404279 -0.0038522 0.0839148 0.0368982 0.0588569 -0.1595732 0.0299125 -0.0635884 -0.0208286 0.5168005 0.3265994 -0.0639628 0.0619866 0.08831 -0.0577695 -0.4781547 -0.7408727 -0.0221223 -0.7408359 -1.2250777 0.0357511 -0.0166784 0.03249 -0.1570912 0.0839076 0.543752 0.0344887 -0.0367635 0.2711139 0.0410253 -0.0519263 -0.1089862 -0.0564327 0.1241552 -0.0164529 -0.0565605 0.0826627 -0.6523309 -0.0713996 -0.0412566 -0.0489598 -0.1556478 0.0935626 -0.0648071 0.0046646 -0.0648093 0.028055 -0.0005304 0.0045658 -0.0004684 0.1521043 0.0959855 0.0587201 0.0200734 0.0488139 0.0190037 -0.0253756 0.0155991 -0.0294131 0.1597206 0.059931 -0.0000136 0.0202491 -0.0086859 0.1474393 -0.0011595 0.016396 -0.0075286 0.1606369 0.1334772 0.028351 0.009922 0.0370144 0.0736447 -0.0162247 0.0136622 -0.0097879 0.1609031 -0.0077554 -0.0032903 0.0339173 0.0065783 0.1234782 -0.0058242 0.0352891 0.0001091 0.1589981 2.7128826 0.6642763 -0.5628482 0.6641814 3.4010468 0.3036507 -0.5656881 0.3052944 0.8742168 -2.0298519 -0.6955009 0.4097713 -0.4214646 -0.8222176 0.0545557 0.4535675 0.1333539 -0.4982394 -0.6153765 0.2884516 0.1314772 0.0143077 -2.2513555 -0.3533664 0.0865182 -0.4310841 -0.4835146 0.4036866 0.0866875 0.0411479 0.0566471 0.7942137 0.0382952 0.0475268 0.0467981 0.4726322 0.6563826 0.1833142 -0.0221036 0.2135768 0.538253 -0.0582712 -0.0276822 -0.0675859 0.47591 unknown
polarizability: 129.9857672|17.5148129|148.1785331|-16.5031099|8.5850459|50.2088605 unknown
InChI: InChI=1S/C7H7O2/c8-7(9)6-4-2-1-3-5-6/h1-5,8-9H
charge 1 multiplicity 1
16 atoms
C  -6.40801237 1.87226255 0.02273955
C  -5.03912184 1.83657174 -0.25523859
C  -4.30606794 3.01624003 -0.27942679
C  -4.95621952 4.23082807 -0.01101982
C  -6.3299218 4.26991032 0.27426658
C  -7.05304386 3.08391888 0.2839218
H  -6.97995658 0.94309803 0.03598649
H  -4.54452835 0.88562266 -0.45333939
H  -3.23751132 3.00343503 -0.49464281
H  -6.82003165 5.22250271 0.47589027
H  -8.12223668 3.10141006 0.49531855
C  -4.1936941 5.4700463 -0.0292036
O  -2.98249319 5.43177724 -0.433476
O  -4.76867289 6.54243938 0.35974479
H  -4.21898842 7.35137499 0.32446683
H  -2.50835027 6.28786633 -0.42386765
