program: Gaussian 16
title: [6+4] or [2+4} they proposed ts guess
version: ES64L-G16RevC.01
frameworkgroup: C1[X(C4H8O)]
method: RM062X
basis: def2SVP
operation: Freq
keyword: #N
keyword: Geom=AllCheck
keyword: Guess=TCheck
keyword: SCRF=Check
keyword: GenChk
keyword: RM062X/def2SVP
keyword: Freq
converged: YES YES YES YES
title: Mulliken charges:
elementType: C O C C C H H H H H H H H
charge: 0.179097 -0.517015 0.179094 -0.126282 -0.126284 0.042794 0.042794 0.042793 0.042793 0.060054 0.060054 0.060054 0.060054
chargesum: 0.00000
title: Mulliken charges with hydrogens summed into heavy atoms:
elementType: C O C C C
charge: 0.264684 -0.517015 0.264681 -0.006174 -0.006177
chargesum: -0.00000
1716.lowfreq: -220.6797 -208.9206 -38.3744 -4.8584 -0.0002 0.0004 0.0006 23.9947 715.8458
frequency: -220.6426 -208.9137 715.8457 735.8004 750.0607 824.3583 929.8984 961.4490 983.0407 985.6129 1096.3632 1147.8972 1200.6120 1219.9540 1245.3841 1247.7873 1254.0607 1269.6513 1305.5340 1371.8670 1412.6427 1453.4421 1468.1484 1501.5775 1514.3905 3056.3252 3065.6862 3105.1059 3105.2002 3106.7227 3116.0418 3158.2387 3171.8744
redmass: 2.3470 1.5956 5.3887 8.2752 1.0860 1.1637 3.8330 1.1943 2.2300 2.9253 2.1222 1.8084 1.2613 10.6691 1.0873 1.0817 1.0390 1.7157 1.4585 1.3499 1.4055 1.0880 1.1222 1.0849 1.1033 1.0578 1.0606 1.1104 1.1123 1.0617 1.0645 1.1100 1.1084
irintensity: 9.2716 0.0000 0.9436 13.6720 6.5708 0.0000 0.0120 2.9981 7.2340 50.4772 15.1715 0.0000 4.3187 263.7100 0.1450 0.0000 0.0000 12.1979 0.5974 5.7780 10.2753 3.6761 14.6538 0.2373 1.0545 165.5977 35.5518 0.1615 118.9167 32.6479 26.3353 0.0000 51.7781
temp: 298.150 k
press: 1.00000 atm
elementType: 6 8 6 6 6 1 1 1 1 1 1 1 1
symmnumber: 1
zpe: 307922.2 jmol-1
zpe.correction: 0.117281 hartree
zpe.thermalcorrener: 0.120834 hartree
zpe.thermalcorrenthalpy: 0.121778 hartree
zpe.thermalcorrgfe: 0.090623 hartree
zpe.sumelectzpe: -232.041155 hartree
zpe.sumelectthermal: -232.037602 hartree
zpe.sumelectthermalent: -232.036658 hartree
zpe.sumelectthermalfe: -232.067813 hartree
dipole: -0.0000 2.4520 0.0000
dipole: 2.4520
quadrupole: -28.5430 -35.3959 -30.2392
quadrupole: 0.0000 0.0000 -0.0000
quadrupole: 2.8497 -4.0032 1.1535 0.0000 0.0000 -0.0000
hfenergy: -232.1584359 hartree
pointgroup: C01 [X(C4H8O1)]
dipole: -0.5495649 0.7928378 -0.0000004 debye
dipolederiv: 1.0372675 0.2345551 0. 0.015528 0.4698651 0. 0.0000001 0. 0.4710586 -1.3390851 -0.2883447 -0.0000002 -0.2883473 -1.1229707 0. -0.0000002 0.0000002 -0.4521453 0.6219152 0.1711798 0. 0.3902076 0.8852181 0.0000001 0. 0. 0.4710587 -0.0839564 0.1067588 -0.0000001 -0.0097519 -0.0089075 0. -0.0000001 0. 0.1077858 0.0137287 -0.0463588 0. 0.0701514 -0.1065913 0.0000001 0. 0. 0.1077854 -0.0423561 -0.0557099 -0.0457064 -0.0505189 -0.0640163 -0.0923342 -0.0848017 -0.1493986 -0.1301161 -0.0423562 -0.0557099 0.0457065 -0.0505189 -0.0640162 0.0923341 0.0848018 0.1493986 -0.1301162 -0.0962577 -0.03032 -0.102505 -0.0355105 -0.0101171 -0.0103982 -0.1696566 -0.0269824 -0.1301172 -0.0962579 -0.0303199 0.102505 -0.0355103 -0.010117 0.0103981 0.1696566 0.0269822 -0.1301169 0.0423269 -0.01892 -0.0071285 -0.0105429 -0.027574 -0.0912552 -0.011485 -0.1361657 -0.0462689 0.0423268 -0.0189201 0.0071285 -0.010543 -0.0275737 0.0912552 0.0114851 0.1361657 -0.0462692 -0.0286478 0.0160548 0.0879541 0.0076785 0.0434002 -0.0253485 0.1315375 -0.037028 -0.0462694 -0.0286478 0.0160547 -0.0879541 0.0076783 0.0434003 0.0253484 -0.1315375 0.0370279 -0.0462695 unknown
polarizability: 60.8288107|4.2391827|57.651469|0.0000003|0.0000005|56.1846891 unknown
InChI: InChI=1S/C4H8O/c1-2-4-5-3-1/h1-4H2
charge 0 multiplicity 1
13 atoms
C  -2.41067072 -1.36329614 3.60291157
O  -0.99134177 -1.3382231 3.60291187
C  -0.46979869 -0.01795059 3.60291173
C  -1.6503662 0.96415449 3.60291074
C  -2.91603999 0.08683204 3.60291091
H  -2.75801355 -1.91379612 2.71423531
H  -2.75801398 -1.91379543 4.49158808
H  0.16758745 0.11412463 4.4915842
H  0.16758846 0.11412401 2.7142399
H  -1.61664433 1.61286805 4.48693838
H  -1.61664382 1.61286693 2.71888229
H  -3.53533336 0.28290194 4.48693801
H  -3.53533308 0.28290124 2.71888346
